{"text_format":"1","workbook":"xlsx","n_sheets":15,"sheets":["Cover","About","Glossary","1.UserDetails","2.RiskAssessment","3.LegalCompliance","4.CC&TR","5.SiteVisitChecklist","6.Summary","7.DDReport","2a","2b","3","4","5"],"not_rendered":{"charts":4,"images":12,"macros":1,"external_links":0,"defined_names":89,"comments":0,"pivot_tables":0},"unopened":[],"bounds":{"document_bytes":16777216,"sheet_cells":100000,"rows_first":2000,"rows_last":500,"rows_between":2000,"halvings":0,"cell_chars":16384,"cell_head_chars":4096},"cells_cut":0,"cells_raw":0,"read":"whole","date_system":"1900"}

{"sheet":"Cover","index":0,"n_rows":0,"n_cols":0,"rows_kept":0,"cut":false,"hidden":false,"merged":[]}

{"sheet":"About","index":1,"n_rows":16,"n_cols":3,"rows_kept":16,"cut":false,"hidden":false,"merged":[[7,2,7,19],[9,2,9,19],[11,2,11,19],[15,2,15,19],[5,2,5,19],[13,2,13,19]]}
[]
[null,"About"]
[]
[null,null,"The Environmental and Social (E&S) Risk Management Toolkit"]
[]
[null,null,"Welcome to the EBRD Environmental and Social Risk Management Toolkit."]
[]
[null,null,"Most frequently defined as “development that meets the needs of the present without compromising the ability of future generations to meet their own needs”, sustainable development has, in recent years, gained increasing prominence as a business issue. Sustainable development covers a very broad, diverse agenda and can be broken down into the five key areas of governance, workplace, marketplace, environment and community as illustrated in the diagram to the right."]
[]
[null,null,"The fundamental core of EBRD’s mission is to pursue sustainable development in its financing arrangements.  To this end, EBRD requires its Financial Intermediaries (FI's) to put in place environmental and social risk management policies and procedures, aligned to EBRD standards."]
[]
[null,null,"The Environmental and Social (E&S) Risk Management Toolkit has been designed to create a user friendly tool to help you to meet the requirements of EBRD’s E&S risk management procedures for corporate loans, SME loans and equity investments (active and passive). The toolkit brings together existing resources developed by EBRD to help you screen transactions for E&S risks and to assess the effectiveness and adequacy of your clients’ E&S risk management systems. The toolkit has been designed to be simple and effective to use – it automatically generates an E&S due diligence report for inclusion in your credit committee file. "]
[]
[null,null,"If your institution does not perform adequate environmental & social due diligence on clients you could be exposed to financial, legal and/or reputational risks. The use of the Environmental and Social Risk Management Toolkit will help minimise your institution’s exposure to risk by assessing if  your clients are environmentally sound and sustainable in the long term. "]
[]
[null,null,"Please complete each section (1-7) of the E&S Toolkit in order. Further guidance and a glossary of terms is available in respective tabs within the toolkit."]

{"sheet":"Glossary","index":2,"n_rows":76,"n_cols":7,"rows_kept":76,"cut":false,"hidden":false,"merged":[]}
[]
[null,"Glossary"]
[]
[]
[null,null,null,null,"Active Equity Investment",null,"An equity investment whereby: (i) the investor makes a significant investment of over 5% of share capital, and (ii) the investor is likely to be able to influence the company´s strategy and management."]
[]
[null,null,null,null,"Child Labour",null,"Child labour is defined here as the employment of children in a manner that is economically exploitative, or is likely to be hazardous, to interfere with the child’s education, or to be harmful to the child’s health, physical, mental, spiritual, moral, or social development."]
[]
[null,null,null,null,"Community investment activities",null,"Activities which reinforce a company's involvement in  the community. Activities are generally aimed at addressing social issues chosen by the company to protect corporate interests, to minimise potential adverse effects of company activities and to enhance reputation. Activities may include financial contributions, donations of goods, services, or employee volunteering time."]
[]
[null,null,null,null,"Community investment strategy",null,"A community investment strategy sets out a company's approach to community investment -  for example enabling activities, how community investment will be measured and focal areas."]
[]
[null,null,null,null,"Contaminated land",null,"Contaminated land is defined legally as land where substances could cause: significant harm to people or protected species, and/or significant pollution of surface waters or groundwater.\nLand may be polluted by: heavy metals, (eg arsenic, cadmium and lead); oils and tars; chemical substances and preparations (eg solvents); gases;  asbestos; and/or radioactive substances.\n"]
[]
[null,null,null,null,"Corporate Citizenship",null,"The concept of corporate citizenship, also known as corporate social responsibility, proposes that businesses have a responsibility to the community in which they operate and to society in general. Typically, corporate citizenship includes several areas of responsibility, such as economic, legal, ethical, philanthropic, and environmental areas. The concept may also be referred to a \"Corporate Social Responsibility (CSR)\" or \"Corporate Sustainability\".\n"]
[]
[null,null,null,null,"Direct Impacts",null,"Direct impacts are those created by the institution as a direct consequence of its business activities, for example energy or paper usage."]
[]
[null,null,null,null,"Employees",null,"Staff who are directly employed by the institution. This will not include contract labour or third parties."]
[]
[null,null,null,null,"Environmental & Social Policy",null,"A written statement which outlines a company's principles and commitment to managing environmental and social aspects of its business activities. There is no standard content for an environmental and social policy, however it may include statements setting strategic environmental and social objectives or commitments to communicate environmental and social expectations to staff, clients and other external stakeholders."]
[]
[null,null,null,null,"Environmental and Social Management System",null,"A standard E&S management system (ESMS) defines the organisational structure, responsibilities, policies, procedures, training, resources and performance targets which are essential for successfully implementing either a business wide or project-specific E&S management programme. An ESMS enables continuous improvement and monitoring of a business or project's E&S performance. It also involves regular disclosure to key stakeholder groups and can lead to improved economic, financial, social and environmental outcomes."]
[]
[null,null,null,null,"Environmental Policy",null,"An Environmental Policy states a company's principles and commitments in relation to managing the environmental aspects and impacts of its operations. Commitments may relate to a company reducing its carbon footprint, improving recycling, minimising waste or reducing reliance on finite natural resources. "]
[]
[null,null,null,null,"Financial Intermediary (FI)",null,"An entity that acts as an intermediate party (or 'middleman') between two parties in a financial transaction. Typically this refers to an institution that facilitates the channelling of funds between lenders and borrowers."]
[]
[null,null,null,null,"Formal Stakeholder Engagement Programme",null,"Stakeholder engagement should be undertaken in a manner which: (a) identifies all relevant stakeholders; (b) details the mechanism by which E&S information will be disclosed to stakeholders; (c) explains how stakeholder consultation relating to E&S issues will be carried out; and (d) establishes a formal grievance mechanism to resolve E&S issues. Stakeholder engagement is undertaken in a manner that is inclusive and culturally appropriate. It provides any affected stakeholders with opportunities to express their views on business risks, impacts and mitigation measures related to E&S issues, and allows the institution to consider and respond to them."]
[]
[null,null,null,null,"Global Reporting Initiative (GRI)",null,"The Global Reporting Initiative is a multi-stakeholder process and independent institution whose mission is to develop and disseminate globally applicable Sustainability Reporting Guidelines.www.globalreporting.org"]
[]
[null,null,null,null,"GM Organisms",null,"Organisms whose genetic material (DNA) has been modified in a way that does not occur naturally, such as through the introduction of a gene from a different organism. "]
[]
[]
[null,null,null,null,"Grievance Mechanism",null,"A grievance mechanism is a procedure for workers (and their unions, where they exist) to raise workplace concerns. The institution should inform all workers of the grievance mechanism or procedure at the time of hire, and make these easily accessible to all workers. The mechanism or procedure should address concerns promptly at an appropriate level of management, using an understandable and transparent process that provides feedback to those concerned, without any retribution. The mechanism or procedure should not impede or delay access to other judicial or administrative remedies that might be available under law or through existing arbitration procedures."]
[]
[null,null,null,null,"Hazardous materials",null,"A hazardous material is any item or agent (biological, chemical or physical) which has the potential to cause harm to humans, animals or the environment, either by itself or through interaction with other factors."]
[]
[null,null,null,null,"Health & Safety Policy",null,"A Health & Safety Policy sets out a company's general approach and commitments for managing health and safety. A Health & Safety Policy is a written statement usually containing three elements (i) a statement section detailing how safety will be managed and that demonstrates a company's commitment to health and safety (ii) a section that details where responsibilities are allocated within a company and how employees fit into the overall safety management system (iii) a section that explains how hazards identified from a company's risk assessment will be controlled."]
[]
[null,null,null,null,"Indirect Impacts",null,"Indirect impacts include cumulative and induced impacts that are generated by the institution as a consequence of the institution’s business i.e. they are secondary in nature."]
[]
[null,null,null,null,"International Labour Organisation (ILO) Requirements",null,"ILO Conventions of relevance include: ILO Convention 87 on Freedom of Association and Protection of the Right to Organise; ILO Convention 98 on the Right to Organise and Collective Bargaining; ILO Convention 29 on Forced Labour; ILO Convention 105 on the Abolition of Forced Labour; ILO Convention 138 on Minimum Age (of Employment); ILO Convention 182 on the Worst Forms of Child Labour; ILO Convention 100 on Equal Remuneration; ILO Convention 111 on Discrimination (Employment and Occupation)."]
[]
[null,null,null,null,"Middle Management",null,"A layer of management whose primary role is to monitor activities of subordinates while reporting to senior management. Middle management are generally not involved in strategic business decisions but are responsible for implementing senior management’s policies and plans."]
[]
[null,null,null,null,"NACE",null,"The Statistical classification of economic activities in the European Community, this will help you to define the portfolio classifications. http://epp.eurostat.ec.europa.eu"]
[]
[null,null,null,null,"Non-Discrimination",null,"The institution should not make employment decisions on the basis of personal characteristics unrelated to inherent job requirements. The institution should base the employment relationship on the principle of equal opportunity and fair treatment, and should not discriminate with respect to aspects of the employment relationship, including recruitment and hiring, compensation (including wages and benefits), working conditions and terms of employment, access to training, promotion, termination of employment or retirement, and discipline. In countries where national law provides for non-discrimination in employment, the institution should comply with national law. When national laws are silent on non-discrimination in employment, the institution should meet the requirements described above. Special measures of protection or assistance to remedy past discrimination or selection for a particular job based on the inherent requirements of the job are not deemed to be discrimination."]
[]
[null,null,null,null,"Non-Employee Workers",null,"Workers not directly employed by the institution, for example contract workers."]
[]
[null,null,null,null,"Occupational Health and Safety",null,"The institution has a responsibility to protect and promote the health of workers, especially by promoting safe and healthy working conditions. This includes ensuring the safety of workers (e.g. reducing the number of accidents), reducing ill-health (e.g. preventing work-related illness and reducing absence) as well as promoting good health."]
[]
[null,null,null,null,"Passive Equity Investment",null,"An equity investment whereby: (i) the investor takes a small stake in the company´s share capital, typically less than 5%, and (ii) the investor is unlikely to have influence over the company´s strategy or management. Examples of passive equity investments include mutual funds, pension funds and funds invested in listed securities."]
[]
[null,null,null,null,"PPE",null,"Personal protective equipment (PPE) is equipment that protects the user against health or safety risks in the workplace. It can include items such as safety helmets and hard hats, gloves, eye protection, high-visibility clothing and safety footwear."]
[]
[null,null,null,null,"Senior Management",null,"Individuals at the highest level of organisational management (e.g. board level/senior executives or business unit heads) who are responsible for managing the senior or executive management and who are decision makers for the strategic direction of the organisation."]
[]
[null,null,null,null,"Site Visit",null,"An operational site visit is defined as a visit to a site that is focused on examining the way in which the business stores, processes and disposes of raw materials and waste products in order to assess its potential environmental impact. It should also examine how the business manages and treats its employees to assess its management of social issues (e.g. health and safety, human rights, engagement with local communities, etc)."]
[]
[null,null,null,null,"SMART Targets",null,"Goals which are Specific, Measurable, Achievable, Realistic and Time-bound. SMART Targets provide companies and individuals with direction and the ability to measure progress over time. "]
[]
[null,null,null,null,"Stakeholders",null,"A person, group, or organisation that has a direct or indirect stake in a business or organisation because it can affect or be affected by the organisation's actions, objectives, policies and procedures. Stakeholders may include investors, shareholders, customers, directors, employees, national or local government authorities, the academic community, nongovernmental organisations, suppliers, unions, and the local community from which the business draws its resources."]
[]
[null,null,null,null,"Third Parties",null,"An individual (or group of individuals) or a corporate entity who/that has indirect involvement with an arrangement, transaction or contract, but is not a principal party."]
[]
[null,null,null,null,"Translocation",null,"Translocation is the transfer of any organism(s) from one site to another. Habitat translocation is the movement of species, mainly plants, (typically including the substrates, such as soil and water, on and in which these species occur) from their original site to a new location."]
[]
[null,null,null,null,"UN Universal Declaration on Human Rights",null,"The Universal Declaration of Human Rights (UDHR) was adopted by the UN General Assembly in 1948 and sets out the fundamental human rights to be universally protected. www.ohchr.org"]
[]
[null,null,null,null,"Workers' Organisations",null,"In countries where national law recognises workers' rights to form and to join workers' organisations of their choosing without interference and to bargain collectively, financial institutions should comply with national law. Where national law substantially restricts workers' organisations, those institutions should enable alternative means for workers to express their grievances and protect their rights regarding working conditions and terms of employment. In either case, the institution should not discourage workers from forming or joining workers’ organisations of their choosing or from bargaining collectively, and should not discriminate or retaliate against workers who participate, or seek to participate, in such organisations and bargain collectively. Financial institutions should engage with such worker representatives or organisations that fairly represent the workers in the workforce."]
[]
[null,null,null,null,"Working Conditions",null,"At a minimum these should provide clarity in terms of the following issues (i) employment practices and terms, (ii) collective bargaining, (iii) workers' organisations, (iv) non-discrimination and equal opportunity, (v) retrenchment/redundancy amongst workers (vi) grievance mechanisms."]

{"sheet":"1.UserDetails","index":3,"n_rows":14,"n_cols":3,"rows_kept":14,"cut":false,"hidden":false,"merged":[[8,12,8,25],[13,12,13,25],[12,12,12,25],[11,12,11,25],[10,12,10,25],[9,12,9,25]]}
[]
[null,"1. User Details"]
[]
[null,null,"Please complete all fields in the section below."]
[]
[null,null,"User Details"]
[]
[]
[null,null,"Name of user"]
[null,null,"FI name"]
[null,null,"Branch name (if applicable)"]
[null,null,"Position/Role"]
[null,null,"Email address"]
[null,null,"Contact number"]

{"sheet":"2.RiskAssessment","index":4,"n_rows":78,"n_cols":33,"rows_kept":78,"cut":false,"hidden":false,"merged":[[22,18,22,21],[25,10,25,13],[24,10,24,13],[23,10,23,13],[77,3,77,9],[37,11,38,13],[76,3,76,25],[74,3,74,25],[73,3,73,25],[72,3,72,25],[32,23,32,25],[37,23,38,25],[38,3,38,10],[33,19,33,20],[15,22,15,25],[14,22,14,25],[13,22,13,25],[9,22,9,25],[10,22,10,25],[19,2,19,26],[22,7,25,7],[25,14,25,17],[22,10,22,13],[29,2,29,26],[26,8,26,21],[24,14,24,17],[23,14,23,17],[22,14,22,17],[22,8,22,9],[23,8,23,9],[24,8,24,9],[25,8,25,9],[25,18,25,21],[24,18,24,21],[23,18,23,21],[3,2,3,26],[77,10,77,19],[37,3,37,5],[8,22,8,25],[8,6,8,13],[9,6,9,13],[10,6,10,13],[15,6,15,16],[14,6,14,16],[13,6,13,16],[34,19,34,20],[32,11,32,13],[32,15,32,17],[37,15,38,17],[32,19,32,21],[37,19,38,21]]}
[]
[null,"2. E&S Risk Assessment"]
[]
[null,null,"Please enter the key transaction details in the section below. On completion, the overall E&S risk associated with the specified transaction will appear in the E&S Risk Matrix. This inherent risk is a function of the sector E&S risk, the transaction type and, where applicable, the length of the loan agreement. If the chosen sector carries a high or medium E&S risk rating, the key E&S issues present in the sector will automatically populate in the E&S Issue Table. For low risk sectors, the E&S Issue Table is not displayed. (Please note that the transaction country does not influence the inherent risk rating generated)."]
[]
[null,null,"Transaction Details",null,null,null,null,null,null,null,null,null,null,null,null,null,null,null,null,null,null,null,null,null,null,null,null,null,null,"ReportSection","#","Control","PrintArea"]
[null,null,null,null,null,null,null,null,null,null,null,null,null,null,null,null,null,null,null,null,null,null,null,null,null,null,null,null,null,"LendingGroup","n/a",{"$f":"IF(OR(LendingType=\"Equity_active\",LendingType=\"Equity_passive\"),\"Equity\",\"Loan\")","v":"Loan"},"n/a"]
[null,null,null,null,null,null,null,null,null,null,null,null,null,null,null,null,null,null,null,null,null,null,null,null,null,null,null,null,null,"RiskMatrix",1,"ON",{"$f":"IF($AF8=\"OFF\",$AG7,\nIF($AF8=\"ON.tr\",\"PDF_\"&$AE8&\".tr\",\n\"PDF_\"&$AE8))","v":"PDF_1"}]
[null,null,"Customer name",null,null,null,null,null,null,null,null,null,null,null,null,null,null,null,"Transaction country",null,null,null,"{Please select}",null,null,null,null,null,null,"IssueTable",2,{"$f":"IF(SectorRiskScore=\"Low\",\"OFF\",\"ON\")","v":"ON"},{"$f":"IF($AF9=\"OFF\",$AG8,\nIF($AF9=\"ON.tr\",\"PDF_\"&$AE9&\".tr\",\n\"PDF_\"&$AE9))","v":"PDF_2"}]
[null,null,"Customer ID",null,null,null,null,null,null,null,null,null,null,null,null,null,null,null,"Transaction type",null,null,null,"{Please select}",null,null,null,null,null,null,"LegalCompliance",3,{"$f":"IF(LendingType=\"Equity_passive\",\"OFF\",\"ON\")","v":"ON"},"PDF_3"]
[null,null,"Assessment date",null,null,null,null,null,null,null,null,null,null,null,null,null,null,null,"Length of loan",null,null,null,"{Please select}",null,null,null,null,null,null,"CC&TR",4,{"$f":"IF(OverallRiskScore=\"Low\",\"OFF\",\nIF(AND(LendingType=\"Equity_passive\",OverallRiskScore=\"Medium\"),\"OFF\",\nIF(AND(LendingType=\"Equity_passive\",OverallRiskScore=\"High\"),\"ON.tr\",\n\"ON\")))","v":"ON"},"PDF_4"]
[null,null,null,null,null,null,null,null,null,null,null,null,null,null,null,null,null,null,null,null,null,null,null,null,null,null,null,null,null,"SVC",5,{"$f":"IF(LendingType=\"Equity_passive\",\"OFF\",\nIF(OverallRiskScore=\"Low\",\"OFF\",\nIF(AND(OverallRiskScore=\"Medium\",LendingType=\"Equity_active\"),\"OFF\",\n\"ON\")))","v":"ON"},"PDF_5"]
[]
[null,null,"Industry",null,null,null,"{Please select}",null,null,null,null,null,null,null,null,null,null,null,"NACE code1",null,null,null,{"$f":"IFERROR(\nINDEX(L_NACE,MATCH(Section&Category&Subcategory,L_SectorID,0)),\n\"{-}\")","v":"{-}"}]
[null,null,"Category",null,null,null,"{Please select}",null,null,null,null,null,null,null,null,null,null,null,"Sector E&S Risk",null,null,null,{"$f":"IFERROR(\nINDEX(L_SectorRiskScore,MATCH(Section&Category&Subcategory,L_SectorID,0)),\n\"{-}\")","v":"{-}"},null,null,null,{"$f":"IFERROR(     MATCH(\" \",$D$41:$D$70,0)-1,     1)","v":0}]
[null,null,"Subcategory",null,null,null,"{Please select}",null,null,null,null,null,null,null,null,null,null,null,"Overall E&S Risk",null,null,null,{"$f":"IFERROR(\nIF(SectorRiskScore=\"Excluded\",\"Excluded\",\nINDEX(OverallRiskMatrix,MATCH(LendingType&LengthOfLoan,OverallRiskMatrix_ROW,0),MATCH(SectorRiskScore,OverallRiskMatrix_COL,0))),\n\"{-}\")","v":"{-}"}]
[]
[null,null,null,null,null,null,null,null,null,null,null,null,null,null,"The selected activity is excluded from financing using EBRD funds – check your agreement with EBRD for details."]
[]
[null,null,"E&S Risk Matrix"]
[]
[]
[null,null,null,null,null,null,null,{"$f":"IF(LendingGroup=\"Equity\",\"Overall Risk  ─────────────────►\",\"Length of Loan  ──────────────►\")","v":"Length of Loan  ──────────────►"},{"$f":"IFERROR(\nINDEX(INDIRECT(\"DD_LengthOfLoan_\"&SUBSTITUTE(LendingType,\" loan\",\"\")),\nIF(LendingGroup=\"Equity\",1,1)),\n\"Long\")","v":"Long"},null,{"$f":"IFERROR(\nINDEX(OverallRiskMatrix,MATCH(LendingType&$I23,OverallRiskMatrix_ROW,0),MATCH(K$26,OverallRiskMatrix_COL,0)),\n\"\")","v":""},null,null,null,{"$f":"IFERROR(\nINDEX(OverallRiskMatrix,MATCH(LendingType&$I23,OverallRiskMatrix_ROW,0),MATCH(O$26,OverallRiskMatrix_COL,0)),\n\"\")","v":""},null,null,null,{"$f":"IFERROR(\nINDEX(OverallRiskMatrix,MATCH(LendingType&$I23,OverallRiskMatrix_ROW,0),MATCH(S$26,OverallRiskMatrix_COL,0)),\n\"\")","v":""}]
[null,null,null,null,null,null,null,null,{"$f":"IFERROR(\nINDEX(INDIRECT(\"DD_LengthOfLoan_\"&SUBSTITUTE(LendingType,\" loan\",\"\")),\nIF(LendingGroup=\"Equity\",1,2)),\n\"Medium\")","v":"Medium"},null,{"$f":"IFERROR(\nINDEX(OverallRiskMatrix,MATCH(LendingType&$I24,OverallRiskMatrix_ROW,0),MATCH(K$26,OverallRiskMatrix_COL,0)),\n\"\")","v":""},null,null,null,{"$f":"IFERROR(\nINDEX(OverallRiskMatrix,MATCH(LendingType&$I24,OverallRiskMatrix_ROW,0),MATCH(O$26,OverallRiskMatrix_COL,0)),\n\"\")","v":""},null,null,null,{"$f":"IFERROR(\nINDEX(OverallRiskMatrix,MATCH(LendingType&$I24,OverallRiskMatrix_ROW,0),MATCH(S$26,OverallRiskMatrix_COL,0)),\n\"\")","v":""}]
[null,null,null,null,null,null,null,null,{"$f":"IFERROR(\nINDEX(INDIRECT(\"DD_LengthOfLoan_\"&SUBSTITUTE(LendingType,\" loan\",\"\")),\nIF(LendingGroup=\"Equity\",1,3)),\n\"Short\")","v":"Short"},null,{"$f":"IFERROR(\nINDEX(OverallRiskMatrix,MATCH(LendingType&$I25,OverallRiskMatrix_ROW,0),MATCH(K$26,OverallRiskMatrix_COL,0)),\n\"\")","v":""},null,null,null,{"$f":"IFERROR(\nINDEX(OverallRiskMatrix,MATCH(LendingType&$I25,OverallRiskMatrix_ROW,0),MATCH(O$26,OverallRiskMatrix_COL,0)),\n\"\")","v":""},null,null,null,{"$f":"IFERROR(\nINDEX(OverallRiskMatrix,MATCH(LendingType&$I25,OverallRiskMatrix_ROW,0),MATCH(S$26,OverallRiskMatrix_COL,0)),\n\"\")","v":""}]
[null,null,null,null,null,null,null,null,null,null,"Low",null,null,null,"Medium",null,null,null,"High"]
[null,null,null,null,null,null,null,null,"Sector Risk Score  ──────────────────────────────────►"]
[]
[]
[null,null,"E&S Issue Table"]
[]
[]
[null,null,null,"E&S Risk Category",null,null,null,null,null,null,null,"Environment",null,null,null,"Health & Safety",null,null,null,"Labour",null,null,null,"Community"]
[]
[]
[]
[]
[null,null,null,"Key E&S Risks",null,null,{"$f":"IFERROR(      IF(INDEX(L_GuidelineStatus,MATCH(NACE,L_NACE,0))=\"Drafted\",2,\"\"),      \"\")","v":""},null,null,null,null,"Affect the natural environment",null,null,null,"Affect the health or safety of employees",null,null,null,"Affect workplace conditions and the treatment of employees",null,null,null,"Affect the health and safety, livelihoods, and environment of the community and wider public"]
[null,null,null,"(in order of materiality)"]
[]
[null,null,{"$f":"IFERROR(     INDEX(L_ESIssueTable,MATCH(NACE,L_NACE,0))&\"i\"&(ROW()-ROW(C$40)),     \"\")","v":""},{"$f":"IFERROR(\nINDEX(ESIssueCategory,MATCH($C41,ESIssueTables_ROW,0)),\n\" \")","v":" "},null,null,null,null,null,null,null,null,{"$f":"IFERROR(\nIF(INDEX(ESIssueTables,MATCH($C41,ESIssueTables_ROW,0),MATCH(L$33,ESIssueTables_COL,0))=\"ü\",\"ü\",\"\"),\n\"\")","v":""},null,null,null,{"$f":"IFERROR(\nIF(INDEX(ESIssueTables,MATCH($C41,ESIssueTables_ROW,0),MATCH(P$33,ESIssueTables_COL,0))=\"ü\",\"ü\",\"\"),\n\"\")","v":""},null,null,null,{"$f":"IFERROR(\nIF(INDEX(ESIssueTables,MATCH($C41,ESIssueTables_ROW,0),MATCH(T$33,ESIssueTables_COL,0))=\"ü\",\"ü\",\"\"),\n\"\")","v":""},null,null,null,{"$f":"IFERROR(\nIF(INDEX(ESIssueTables,MATCH($C41,ESIssueTables_ROW,0),MATCH(X$33,ESIssueTables_COL,0))=\"ü\",\"ü\",\"\"),\n\"\")","v":""}]
[null,null,""," ",null,null,null,null,null,null,null,null,{"$f":"IFERROR(\nIF(INDEX(ESIssueTables,MATCH($C42,ESIssueTables_ROW,0),MATCH(L$33,ESIssueTables_COL,0))=\"ü\",\"ü\",\"\"),\n\"\")","v":""},null,null,null,{"$f":"IFERROR(\nIF(INDEX(ESIssueTables,MATCH($C42,ESIssueTables_ROW,0),MATCH(P$33,ESIssueTables_COL,0))=\"ü\",\"ü\",\"\"),\n\"\")","v":""},null,null,null,{"$f":"IFERROR(\nIF(INDEX(ESIssueTables,MATCH($C42,ESIssueTables_ROW,0),MATCH(T$33,ESIssueTables_COL,0))=\"ü\",\"ü\",\"\"),\n\"\")","v":""},null,null,null,{"$f":"IFERROR(\nIF(INDEX(ESIssueTables,MATCH($C42,ESIssueTables_ROW,0),MATCH(X$33,ESIssueTables_COL,0))=\"ü\",\"ü\",\"\"),\n\"\")","v":""}]
[null,null,""," ",null,null,null,null,null,null,null,null,"",null,null,null,"",null,null,null,"",null,null,null,""]
[null,null,""," ",null,null,null,null,null,null,null,null,"",null,null,null,"",null,null,null,"",null,null,null,""]
[null,null,""," ",null,null,null,null,null,null,null,null,"",null,null,null,"",null,null,null,"",null,null,null,""]
[null,null,""," ",null,null,null,null,null,null,null,null,"",null,null,null,"",null,null,null,"",null,null,null,""]
[null,null,""," ",null,null,null,null,null,null,null,null,"",null,null,null,"",null,null,null,"",null,null,null,""]
[null,null,""," ",null,null,null,null,null,null,null,null,"",null,null,null,"",null,null,null,"",null,null,null,""]
[null,null,""," ",null,null,null,null,null,null,null,null,"",null,null,null,"",null,null,null,"",null,null,null,""]
[null,null,""," ",null,null,null,null,null,null,null,null,"",null,null,null,"",null,null,null,"",null,null,null,""]
[null,null,""," ",null,null,null,null,null,null,null,null,"",null,null,null,"",null,null,null,"",null,null,null,""]
[null,null,""," ",null,null,null,null,null,null,null,null,"",null,null,null,"",null,null,null,"",null,null,null,""]
[null,null,""," ",null,null,null,null,null,null,null,null,"",null,null,null,"",null,null,null,"",null,null,null,""]
[null,null,""," ",null,null,null,null,null,null,null,null,"",null,null,null,"",null,null,null,"",null,null,null,""]
[null,null,""," ",null,null,null,null,null,null,null,null,"",null,null,null,"",null,null,null,"",null,null,null,""]
[null,null,""," ",null,null,null,null,null,null,null,null,"",null,null,null,"",null,null,null,"",null,null,null,""]
[null,null,""," ",null,null,null,null,null,null,null,null,"",null,null,null,"",null,null,null,"",null,null,null,""]
[null,null,""," ",null,null,null,null,null,null,null,null,"",null,null,null,"",null,null,null,"",null,null,null,""]
[null,null,""," ",null,null,null,null,null,null,null,null,"",null,null,null,"",null,null,null,"",null,null,null,""]
[null,null,""," ",null,null,null,null,null,null,null,null,"",null,null,null,"",null,null,null,"",null,null,null,""]
[null,null,""," ",null,null,null,null,null,null,null,null,"",null,null,null,"",null,null,null,"",null,null,null,""]
[null,null,""," ",null,null,null,null,null,null,null,null,"",null,null,null,"",null,null,null,"",null,null,null,""]
[null,null,""," ",null,null,null,null,null,null,null,null,"",null,null,null,"",null,null,null,"",null,null,null,""]
[null,null,""," ",null,null,null,null,null,null,null,null,"",null,null,null,"",null,null,null,"",null,null,null,""]
[null,null,""," ",null,null,null,null,null,null,null,null,"",null,null,null,"",null,null,null,"",null,null,null,""]
[null,null,""," ",null,null,null,null,null,null,null,null,"",null,null,null,"",null,null,null,"",null,null,null,""]
[null,null,""," ",null,null,null,null,null,null,null,null,"",null,null,null,"",null,null,null,"",null,null,null,""]
[null,null,""," ",null,null,null,null,null,null,null,null,"",null,null,null,"",null,null,null,"",null,null,null,""]
[null,null,""," ",null,null,null,null,null,null,null,null,"",null,null,null,"",null,null,null,"",null,null,null,""]
[null,null,""," ",null,null,null,null,null,null,null,null,"",null,null,null,"",null,null,null,"",null,null,null,""]
[]
[]
[null,null,"1","Business activities are ranked according to the EU statistical classification codes NACE Rev. 2 (based on the Regulation"]
[null,null,null,"(EC) No 1893/2006 of the European Parliament & of the Council, establishing the statistical classification of economic"]
[null,null,null,"activities NACE Rev. 2, adopted on 19 December 2006)."]
[]
[null,null,{"$f":"IFERROR(      IF(INDEX(L_GuidelineStatus,MATCH(NACE,L_NACE,0))=\"Drafted\",2,\"\"),      \"\")","v":""},{"$f":"IFERROR(      IF(INDEX(L_GuidelineStatus,MATCH(NACE,L_NACE,0))=\"Drafted\",\n\"For more information on the key E&S issues present in this sector, please consult the relevant chapter in EBRD's Subsectoral\",\n\"\"),      \"\")","v":""}]
[null,null,null,{"$f":"IFERROR(      IF(INDEX(L_GuidelineStatus,MATCH(NACE,L_NACE,0))=\"Drafted\",\n\"environmental and social guidelines:\",\n\"\"),      \"\")","v":""},null,null,null,null,null,null,{"$f":"IFERROR(      IF(INDEX(L_GuidelineStatus,MATCH(NACE,L_NACE,0))=\"Drafted\",\n\"http://www.ebrd.com/environment/e-manual/af6guide.html\",\n\"\"),      \"\")","v":""}]

{"sheet":"3.LegalCompliance","index":5,"n_rows":23,"n_cols":22,"rows_kept":23,"cut":false,"hidden":false,"merged":[[18,21,22,25],[22,2,22,17],[21,2,21,17],[20,2,20,17],[10,2,10,17],[19,2,19,17],[18,2,18,17],[15,2,15,17],[15,21,15,25],[0,21,2,16383],[7,2,7,17],[14,2,14,17],[17,2,17,17],[17,21,17,25],[14,21,14,25],[7,21,7,25],[8,21,10,25],[9,2,9,17],[8,2,8,17]]}
[null,null,null,null,null,null,null,null,null,null,null,null,null,null,null,null,null,null,null,null,null,"NOT REQUIRED FOR \nSPECIFIED TRANSACTION"]
[null,"3. Legal Compliance Check"]
[]
[null,null,"Please provide answers to each of the questions listed in the section(s) below."]
[]
[null,null,"(i) Regulatory Compliance"]
[]
[null,null,"Key Considerations",null,null,null,null,null,null,null,null,null,null,null,null,null,null,null,null,"Y/N",null,"Comments"]
[null,null,"Has your client confirmed in writing that they are in compliance with all environmental and social legislation applicable to their business/operations? "]
[null,null,"Despite receiving written confirmation, are you nevertheless concerned that your client is not in compliance with all environmental and social legislation applicable to their business/operations? "]
[null,null,"If you remain concerned, have you checked compliance through the review of permits/licences or through direct contact with the local regulator? "]
[]
[null,null,"(ii) Contaminated Land Issues"]
[]
[null,null,"Applicability",null,null,null,null,null,null,null,null,null,null,null,null,null,null,null,null,"Y/N",null,"Comments"]
[null,null,"Are land/buildings to be taken as security/collateral for the loan?"]
[]
[null,null,"Key Considerations",null,null,null,null,null,null,null,null,null,null,null,null,null,null,null,null,"Y/N",null,"Comments"]
[null,null,"Is there any past and present known contamination to soils or groundwater associated with the site, either through company activities or contamination flowing from neighbouring sites?"]
[null,null,"Is the site free from evidence of leaks or spills around storage tanks/areas and process equipment?"]
[null,null,"Is there adequate protection, such as secondary containment, around storage tanks?"]
[null,null,"Are underground installations such as storage tanks and sewer systems, where present, inspected regularly?"]
[null,null,"Are any specialist reports available examining the site’s geology and history from a potential contamination viewpoint?"]

{"sheet":"4.CC&TR","index":6,"n_rows":110,"n_cols":27,"rows_kept":110,"cut":false,"hidden":false,"merged":[[17,2,17,25],[0,21,2,27],[6,2,6,5],[4,19,4,23],[4,13,4,17],[106,2,106,4],[107,2,107,4],[4,2,4,5],[4,7,4,11],[6,19,6,23],[6,13,6,17],[6,7,6,11],[99,2,99,4],[100,2,100,4],[101,2,101,4],[103,2,103,23],[104,2,104,4],[105,2,105,4],[92,2,92,4],[93,2,93,4],[94,2,94,4],[95,2,95,4],[97,2,97,23],[98,2,98,4],[85,2,85,23],[86,2,86,4],[87,2,87,4],[88,2,88,4],[89,2,89,4],[91,2,91,23],[77,2,77,4],[79,2,79,23],[80,2,80,4],[81,2,81,4],[82,2,82,4],[83,2,83,4],[81,5,81,23],[80,5,80,23],[77,5,77,23],[87,5,87,23],[86,5,86,23],[83,5,83,23],[82,5,82,23],[68,2,68,4],[69,2,69,4],[73,2,73,23],[74,2,74,4],[75,2,75,4],[76,2,76,4],[61,2,61,4],[62,2,62,4],[63,2,63,4],[65,2,65,23],[66,2,66,4],[67,2,67,4],[66,5,66,23],[61,5,61,23],[69,5,69,23],[68,5,68,23],[67,5,67,23],[63,5,63,23],[62,5,62,23],[76,5,76,23],[75,5,75,23],[74,5,74,23],[72,2,72,25],[59,2,59,23],[60,2,60,4],[47,2,47,23],[48,2,48,4],[49,2,49,4],[50,2,50,4],[51,2,51,4],[53,2,53,23],[60,5,60,23],[57,5,57,23],[56,5,56,23],[55,5,55,23],[54,5,54,23],[51,5,51,23],[50,5,50,23],[49,5,49,23],[48,5,48,23],[42,5,42,23],[41,5,41,23],[40,5,40,23],[37,5,37,23],[36,5,36,23],[54,2,54,4],[55,2,55,4],[56,2,56,4],[57,2,57,4],[107,5,107,23],[106,5,106,23],[105,5,105,23],[104,5,104,23],[101,5,101,23],[100,5,100,23],[99,5,99,23],[98,5,98,23],[21,2,21,23],[27,2,27,23],[28,2,28,4],[28,5,28,23],[29,2,29,4],[29,5,29,23],[25,5,25,23],[24,5,24,23],[23,5,23,23],[22,5,22,23],[25,2,25,4],[24,2,24,4],[23,2,23,4],[22,2,22,4],[37,2,37,4],[39,2,39,23],[13,2,13,25],[15,2,15,25],[11,2,11,25],[95,5,95,23],[94,5,94,23],[93,5,93,23],[92,5,92,23],[89,5,89,23],[88,5,88,23],[40,2,40,4],[41,2,41,4],[42,2,42,4],[43,2,43,4],[30,2,30,4],[31,2,31,4],[33,2,33,23],[34,2,34,4],[35,2,35,4],[36,2,36,4],[35,5,35,23],[34,5,34,23],[31,5,31,23],[30,5,30,23],[43,5,43,23]]}
[null,null,null,null,null,null,null,null,null,null,null,null,null,null,null,null,null,null,null,null,null,"NOT REQUIRED FOR \nSPECIFIED TRANSACTION"]
[null,"4. Commitment, Capacity and Track Record Questionnaire"]
[]
[]
[null,null,"Navigate \nto section",null,null,null,null,"Commitment",null,null,null,null,null,"Capacity",null,null,null,null,null,"Track Record"]
[null,null,null,null,null,null,null,{"$f":"COUNTIFS('4'!$D$8:$D$11,\"<>0\")/4","v":0},null,null,null,null,null,{"$f":"COUNTIFS('4'!$D$13:$D$16,\"<>0\")/4","v":0},null,null,null,null,null,{"$f":"COUNTIFS('4'!$D$18:$D$23,\"<>0\")/6","v":0}]
[null,null,"% progress",null,null,null,null,{"$f":"IF(Ctrl_4<>\"ON\",\"n/a\",       IF(H6=1,\"Complete\",H6)      )","v":0},null,null,null,null,null,{"$f":"IF(Ctrl_4<>\"ON\",\"n/a\",      IF(N6=1,\"Complete\",N6)     )","v":0},null,null,null,null,null,{"$f":"IF(Ctrl_4=\"OFF\",\"n/a\",     IF(T6=1,\"Complete\",T6)     )","v":0}]
[]
[]
[null,null,"Introduction"]
[]
[null,null,"This tab helps you to assess the effectiveness and adequacy of your clients’ E&S risk management systems by evaluating their commitment, capacity and/or track record to manage these issues. Please note that you may need to engage with your client when completing this questionnaire. This could be achieved either on the telephone or face to face."]
[]
[null,null,"For each question, please select the statement which most applies to your client, based on the responses provided. Once you have completed all of the questions in the three sections you will be provided with an illustrative diagram that includes an indicative industry standard benchmark with which to compare your client’s score."]
[]
[null,null,"Overall E&S risk rating requirements (from Tab 2)*: \n• Low – No requirement to complete this questionnaire.\n• Medium – Consider using the output of this questionnaire as one means of deciding whether to conduct an operational site visit. \n• High – Decision to undertake an operational site visit is not subject to the output of this questionnaire and should be conducted as per the requirements outlined in EBRD’s E&S risk management procedures.\n\n*Please be aware that for high risk passive equity investments, only the track record section of this questionnaire will need to be completed, as per EBRD's E&S lending requirements. There is also no requirement to undertake an operational site visit for passive equity investments."]
[]
[null,null,"*Please be aware that for high risk passive equity investments, only the track record section of this questionnaire will need to be completed. There is also no requirement to undertake an operational site visit for passive equity investments, as per EBRD's E&S risk management requirements."]
[]
[null,null,"(i) Commitment"]
[]
[null,null,"What Environmental and Social (E&S) Policy commitments does the client have in place?",null,null,null,null,null,null,null,null,null,null,null,null,null,null,null,null,null,null,null,null,null,null,"Y/N"]
[null,null,"Best \nPractice",null,null,"Leading E&S Policy: The client's policy states in detail its commitment to: (a) comply with industry best practice guidelines and national legislation; (b) the principle of continuous improvement; (c) address all key E&S risks resulting from, or relevant to, its activities; (d) apply E&S policy requirements to Third Parties; and (e) actively engage with and disclose all relevant E&S information to its stakeholders.",null,null,null,null,null,null,null,null,null,null,null,null,null,null,null,null,null,null,null,{"$f":"IF(Ctrl_4=\"ON.tr\",\"n/a\",\"\")","v":""},{"$f":"IF('4'!$D$8=0,0,IF('4'!$D$8<>1,1,0))","v":0}]
[null,null,"Good \nPractice",null,null,"Standard E&S Policy: The client's policy states its commitment to: (a) comply with standard industry approaches and national legislation; (b) the principle of continuous improvement (c) address all key E&S risks resulting from, or relevant to, its activities; and (d) engage and disclose all relevant E&S information to its stakeholders.",null,null,null,null,null,null,null,null,null,null,null,null,null,null,null,null,null,null,null,{"$f":"IF(Ctrl_4=\"ON.tr\",\"n/a\",\"\")","v":""},{"$f":"IF('4'!$D$8=0,0,IF('4'!$D$8<>2,1,0))","v":0}]
[null,null,"Satisfactory",null,null,"Incomplete E&S Policy: The client's policy provides only a high level statement of its commitment to E&S standards and to addressing the key E&S risks resulting from, or relevant to, its activities. The policy provides limited or no information with regard to information disclosure and engagement of stakeholders.",null,null,null,null,null,null,null,null,null,null,null,null,null,null,null,null,null,null,null,{"$f":"IF(Ctrl_4=\"ON.tr\",\"n/a\",\"\")","v":""},{"$f":"IF('4'!$D$8=0,0,IF('4'!$D$8<>3,1,0))","v":0}]
[null,null,"Deficient",null,null,"No E&S Policy: The client does not have an E&S policy or has not made its E&S policy available.",null,null,null,null,null,null,null,null,null,null,null,null,null,null,null,null,null,null,null,{"$f":"IF(Ctrl_4=\"ON.tr\",\"n/a\",\"\")","v":""},{"$f":"IF('4'!$D$8=0,0,IF('4'!$D$8<>4,1,0))","v":0}]
[]
[null,null,"What is the commitment level of Senior Management to Environmental and Social (E&S) Issues?",null,null,null,null,null,null,null,null,null,null,null,null,null,null,null,null,null,null,null,null,null,null,"Y/N"]
[null,null,"Best \nPractice",null,null,"High Level of Senior Management Commitment: Senior Management: (a) has oversight and/or responsibility for the application of E&S policies and E&S risk management; (b) always considers E&S issues when making business decisions; and (c) remuneration is aligned to performance in the management of E&S issues. ",null,null,null,null,null,null,null,null,null,null,null,null,null,null,null,null,null,null,null,{"$f":"IF(Ctrl_4=\"ON.tr\",\"n/a\",\"\")","v":""},{"$f":"IF('4'!$D$9=0,0,IF('4'!$D$9<>1,1,0))","v":0}]
[null,null,"Good \nPractice",null,null,"Standard Level of Senior Management Commitment: Middle Management mostly has oversight and/or responsibility for the application of E&S policies and E&S management system; E&S issues are sometimes considered by Senior Management when making business decisions. ",null,null,null,null,null,null,null,null,null,null,null,null,null,null,null,null,null,null,null,{"$f":"IF(Ctrl_4=\"ON.tr\",\"n/a\",\"\")","v":""},{"$f":"IF('4'!$D$9=0,0,IF('4'!$D$9<>2,1,0))","v":0}]
[null,null,"Satisfactory",null,null,"Limited Level of Senior Management Commitment: Middle Management has responsibility for E&S issues; E&S issues are seldom considered by Senior Management when making business decisions.",null,null,null,null,null,null,null,null,null,null,null,null,null,null,null,null,null,null,null,{"$f":"IF(Ctrl_4=\"ON.tr\",\"n/a\",\"\")","v":""},{"$f":"IF('4'!$D$9=0,0,IF('4'!$D$9<>3,1,0))","v":0}]
[null,null,"Deficient",null,null,"No Senior Management Commitment: There is no Senior Management responsibility for E&S issues; E&S issues are never considered by Senior Management when making business decisions.",null,null,null,null,null,null,null,null,null,null,null,null,null,null,null,null,null,null,null,{"$f":"IF(Ctrl_4=\"ON.tr\",\"n/a\",\"\")","v":""},{"$f":"IF('4'!$D$9=0,0,IF('4'!$D$9<>4,1,0))","v":0}]
[]
[null,null,"How does the client engage with stakeholders on Environmental and Social (E&S) Issues?",null,null,null,null,null,null,null,null,null,null,null,null,null,null,null,null,null,null,null,null,null,null,"Y/N"]
[null,null,"Best \nPractice",null,null,"Integrated Stakeholder Engagement: In addition to the implementation of a Formal Stakeholder Engagement Programme, the client demonstrates the active integration of stakeholder feedback and needs into E&S policy frameworks and management systems that influence business decision making.",null,null,null,null,null,null,null,null,null,null,null,null,null,null,null,null,null,null,null,{"$f":"IF(Ctrl_4=\"ON.tr\",\"n/a\",\"\")","v":""},{"$f":"IF('4'!$D$10=0,0,IF('4'!$D$10<>1,1,0))","v":0}]
[null,null,"Good \nPractice",null,null,"Formalised Stakeholder Engagement: A Formal Stakeholder Engagement Programme has been implemented and the client engages in regular dialogue on E&S issues with all key stakeholders.",null,null,null,null,null,null,null,null,null,null,null,null,null,null,null,null,null,null,null,{"$f":"IF(Ctrl_4=\"ON.tr\",\"n/a\",\"\")","v":""},{"$f":"IF('4'!$D$10=0,0,IF('4'!$D$10<>2,1,0))","v":0}]
[null,null,"Satisfactory",null,null,"Reactive Stakeholder Engagement: There is no Formal Stakeholder Engagement Programme, and the client engages with stakeholders on an ad hoc and reactive basis (typically only in the event of a crisis), and on a limited range of issues which often do not include E&S issues.",null,null,null,null,null,null,null,null,null,null,null,null,null,null,null,null,null,null,null,{"$f":"IF(Ctrl_4=\"ON.tr\",\"n/a\",\"\")","v":""},{"$f":"IF('4'!$D$10=0,0,IF('4'!$D$10<>3,1,0))","v":0}]
[null,null,"Deficient",null,null,"No Stakeholder Engagement: The client does not engage with stakeholders on E&S issues.",null,null,null,null,null,null,null,null,null,null,null,null,null,null,null,null,null,null,null,{"$f":"IF(Ctrl_4=\"ON.tr\",\"n/a\",\"\")","v":""},{"$f":"IF('4'!$D$10=0,0,IF('4'!$D$10<>4,1,0))","v":0}]
[]
[null,null,"What is the level of commitment to the Environmental and Social (E&S) Performance of Third Parties (e.g. a client, supplier and/or principal contractor which has an active and substantial role which is material to business operations)?",null,null,null,null,null,null,null,null,null,null,null,null,null,null,null,null,null,null,null,null,null,null,"Y/N"]
[null,null,"Best \nPractice",null,null,"High Level of Commitment to Third Party E&S Performance: Where third parties have an active role which is material to business operations, the client requires Third Parties to apply the same E&S policy and  performance requirements that it applies to itself, provides training and support to Third Parties on E&S performance, and periodically audits their E&S performance.",null,null,null,null,null,null,null,null,null,null,null,null,null,null,null,null,null,null,null,{"$f":"IF(Ctrl_4=\"ON.tr\",\"n/a\",\"\")","v":""},{"$f":"IF('4'!$D$11=0,0,IF('4'!$D$11<>1,1,0))","v":0}]
[null,null,"Good \nPractice",null,null,"Adequate Level of Commitment to Third Party E&S Performance: Where Third Parties have an active role which is material to business operations, the client requires Third Parties to apply the same E&S policy and performance requirements that it applies to itself.",null,null,null,null,null,null,null,null,null,null,null,null,null,null,null,null,null,null,null,{"$f":"IF(Ctrl_4=\"ON.tr\",\"n/a\",\"\")","v":""},{"$f":"IF('4'!$D$11=0,0,IF('4'!$D$11<>2,1,0))","v":0}]
[null,null,"Satisfactory",null,null,"Limited Level of Commitment to Third Party E&S Performance: Where Third Parties have an active role which is material to business operations, the client only has limited Third Party E&S policy and performance requirements (i.e. E&S requirements may be lower than what the client applies to itself or performance requirements cover limited E&S risk).",null,null,null,null,null,null,null,null,null,null,null,null,null,null,null,null,null,null,null,{"$f":"IF(Ctrl_4=\"ON.tr\",\"n/a\",\"\")","v":""},{"$f":"IF('4'!$D$11=0,0,IF('4'!$D$11<>3,1,0))","v":0}]
[null,null,"Deficient",null,null,"No Commitment to Third Party E&S Performance: Where Third Parties have an active role which is material to business operations, the client does not have any E&S performance requirements for Third Parties.",null,null,null,null,null,null,null,null,null,null,null,null,null,null,null,null,null,null,null,{"$f":"IF(Ctrl_4=\"ON.tr\",\"n/a\",\"\")","v":""},{"$f":"IF('4'!$D$11=0,0,IF('4'!$D$11<>4,1,0))","v":0}]
[]
[null,null,"(ii) Capacity"]
[]
[null,null,"How comprehensive is the client's Environmental and Social Management System (ESMS)?",null,null,null,null,null,null,null,null,null,null,null,null,null,null,null,null,null,null,null,null,null,null,"Y/N"]
[null,null,"Best \nPractice",null,null,"Comprehensive ESMS: The client has a Standard ESMS which is: (a) fully and systematically integrated into broader company management; (b) certified (>70% of total operations) to at least one internationally recognised standard (e.g. ISO 14001, OHSAS 18001, SA 8000); and (c) independently verified.",null,null,null,null,null,null,null,null,null,null,null,null,null,null,null,null,null,null,null,{"$f":"IF(Ctrl_4=\"ON.tr\",\"n/a\",\"\")","v":""},{"$f":"IF('4'!$D$13=0,0,IF('4'!$D$13<>1,1,0))","v":0}]
[null,null,"Good \nPractice",null,null,"Standard ESMS: The client has a Standard ESMS which is capable of being certified to an international standard (e.g. ISO 14001), sets targets for material impacts and reports on progress, and the effectiveness of which is internally audited on a regular periodic basis.",null,null,null,null,null,null,null,null,null,null,null,null,null,null,null,null,null,null,null,{"$f":"IF(Ctrl_4=\"ON.tr\",\"n/a\",\"\")","v":""},{"$f":"IF('4'!$D$13=0,0,IF('4'!$D$13<>2,1,0))","v":0}]
[null,null,"Satisfactory",null,null,"Partial ESMS: The client's ESMS is characterised by: (a) partial coverage of key E&S risks; (b) limited commitment to specific targets; and (c) limited disclosure of information. ",null,null,null,null,null,null,null,null,null,null,null,null,null,null,null,null,null,null,null,{"$f":"IF(Ctrl_4=\"ON.tr\",\"n/a\",\"\")","v":""},{"$f":"IF('4'!$D$13=0,0,IF('4'!$D$13<>3,1,0))","v":0}]
[null,null,"Deficient",null,null,"Deficient or Absent ESMS: The client does not have an ESMS or, if one exists, it is characterised by little or no detail relating to: (a) coverage of E&S risks; (b) specific focus or targets; and (c) disclosure of information.",null,null,null,null,null,null,null,null,null,null,null,null,null,null,null,null,null,null,null,{"$f":"IF(Ctrl_4=\"ON.tr\",\"n/a\",\"\")","v":""},{"$f":"IF('4'!$D$13=0,0,IF('4'!$D$13<>4,1,0))","v":0}]
[]
[null,null,"What organisational capacity exists to manage Environmental and Social (E&S) issues?",null,null,null,null,null,null,null,null,null,null,null,null,null,null,null,null,null,null,null,null,null,null,"Y/N"]
[null,null,"Best \nPractice",null,null,"Strong Organisational Capacity to Manage E&S Issues: Appropriately qualified staff with clearly defined and specific E&S responsibilities are embedded across all relevant areas of the client's business, and responsibilities are clearly aligned to the ESMS. All staff with lead responsibility for E&S issue management have this articulated in their job specifications and are incentivised and rewarded appropriately. ",null,null,null,null,null,null,null,null,null,null,null,null,null,null,null,null,null,null,null,{"$f":"IF(Ctrl_4=\"ON.tr\",\"n/a\",\"\")","v":""},{"$f":"IF('4'!$D$14=0,0,IF('4'!$D$14<>1,1,0))","v":0}]
[null,null,"Good \nPractice",null,null,"Standard Organisational Capacity to Manage E&S Issues: Appropriately qualified staff are appointed to monitor and oversee E&S issues, with responsibilities clearly aligned to the ESMS.",null,null,null,null,null,null,null,null,null,null,null,null,null,null,null,null,null,null,null,{"$f":"IF(Ctrl_4=\"ON.tr\",\"n/a\",\"\")","v":""},{"$f":"IF('4'!$D$14=0,0,IF('4'!$D$14<>2,1,0))","v":0}]
[null,null,"Satisfactory",null,null,"Limited Organisational Capacity to Manage E&S Issues: Day-to-day E&S responsibilities are unclear, with uncertain capacity across breadth of operations and/or evidence of partial qualifications or competencies to deal with E&S issues. Limited evidence to show E&S responsibilities are aligned to the ESMS.",null,null,null,null,null,null,null,null,null,null,null,null,null,null,null,null,null,null,null,{"$f":"IF(Ctrl_4=\"ON.tr\",\"n/a\",\"\")","v":""},{"$f":"IF('4'!$D$14=0,0,IF('4'!$D$14<>3,1,0))","v":0}]
[null,null,"Deficient",null,null,"Insufficient Organisational Capacity to Manage E&S Issues: No specific capacity or accountability for E&S issues, with no staff responsibility for the ESMS.",null,null,null,null,null,null,null,null,null,null,null,null,null,null,null,null,null,null,null,{"$f":"IF(Ctrl_4=\"ON.tr\",\"n/a\",\"\")","v":""},{"$f":"IF('4'!$D$14=0,0,IF('4'!$D$14<>4,1,0))","v":0}]
[]
[null,null,"Are staff appropriately trained on relevant Environmental and Social (E&S) issues?",null,null,null,null,null,null,null,null,null,null,null,null,null,null,null,null,null,null,null,null,null,null,"Y/N"]
[null,null,"Best \nPractice",null,null,"High Level of E&S Training: Employees and Third Parties receive appropriate and comprehensive E&S training, which also covers the organisation's ESMS. Mandatory E&S training on certain modules (e.g. Occupational Health and Safety (OH&S)) is required for all staff on an ongoing basis to ensure knowledge is up-to-date, as well as mandatory E&S induction training for new joiners.",null,null,null,null,null,null,null,null,null,null,null,null,null,null,null,null,null,null,null,{"$f":"IF(Ctrl_4=\"ON.tr\",\"n/a\",\"\")","v":""},{"$f":"IF('4'!$D$15=0,0,IF('4'!$D$15<>1,1,0))","v":0}]
[null,null,"Good \nPractice",null,null,"Adequate Level of E&S Training: Employees receive adequate training which covers the organisation's ESMS and E&S issues relevant to their roles (including OH&S and emergency planning/preparedness).",null,null,null,null,null,null,null,null,null,null,null,null,null,null,null,null,null,null,null,{"$f":"IF(Ctrl_4=\"ON.tr\",\"n/a\",\"\")","v":""},{"$f":"IF('4'!$D$15=0,0,IF('4'!$D$15<>2,1,0))","v":0}]
[null,null,"Satisfactory",null,null,"Limited Level of E&S Training: Only staff with key E&S responsibilities receive training; training is partial in detail and completeness with limited links to the organisation's ESMS.",null,null,null,null,null,null,null,null,null,null,null,null,null,null,null,null,null,null,null,{"$f":"IF(Ctrl_4=\"ON.tr\",\"n/a\",\"\")","v":""},{"$f":"IF('4'!$D$15=0,0,IF('4'!$D$15<>3,1,0))","v":0}]
[null,null,"Deficient",null,null,"No E&S Training: Employees do not receive any E&S training. ",null,null,null,null,null,null,null,null,null,null,null,null,null,null,null,null,null,null,null,{"$f":"IF(Ctrl_4=\"ON.tr\",\"n/a\",\"\")","v":""},{"$f":"IF('4'!$D$15=0,0,IF('4'!$D$15<>4,1,0))","v":0}]
[]
[null,null,"How does the client manage the Environmental and Social (E&S) Capacity of Third Parties (e.g. a client, supplier and/or principal contractor which has an active and substantial role which is material to business operations)?",null,null,null,null,null,null,null,null,null,null,null,null,null,null,null,null,null,null,null,null,null,null,"Y/N"]
[null,null,"Best \nPractice",null,null,"Strong Management of E&S Third Party Capacity: The client displays a systematic approach to assessing and managing Third Party E&S capacity  (e.g. conducts site visits to check E&S issue management resourcing and training levels, and regularly reviews and monitors E&S governance structures). The client is part of a broader alliance (e.g. labour unions, communities etc.) to deliver E&S benefits and opportunities. ",null,null,null,null,null,null,null,null,null,null,null,null,null,null,null,null,null,null,null,{"$f":"IF(Ctrl_4=\"ON.tr\",\"n/a\",\"\")","v":""},{"$f":"IF('4'!$D$16=0,0,IF('4'!$D$16<>1,1,0))","v":0}]
[null,null,"Good \nPractice",null,null,"Adequate Management of E&S Third Party Capacity: The client displays active assessment and management of the E&S capacity of Third Parties (e.g. through the use of procurement checklists to identify E&S issue management resources).",null,null,null,null,null,null,null,null,null,null,null,null,null,null,null,null,null,null,null,{"$f":"IF(Ctrl_4=\"ON.tr\",\"n/a\",\"\")","v":""},{"$f":"IF('4'!$D$16=0,0,IF('4'!$D$16<>2,1,0))","v":0}]
[null,null,"Satisfactory",null,null,"Limited Management of Third Party E&S Capacity: The client has not implemented appropriate systems and procedures to identify and manage Third Party E&S risks. ",null,null,null,null,null,null,null,null,null,null,null,null,null,null,null,null,null,null,null,{"$f":"IF(Ctrl_4=\"ON.tr\",\"n/a\",\"\")","v":""},{"$f":"IF('4'!$D$16=0,0,IF('4'!$D$16<>3,1,0))","v":0}]
[null,null,"Deficient",null,null,"No Management of Third Party E&S Capacity: The client does not manage or take responsibility for Third Party E&S risks.",null,null,null,null,null,null,null,null,null,null,null,null,null,null,null,null,null,null,null,{"$f":"IF(Ctrl_4=\"ON.tr\",\"n/a\",\"\")","v":""},{"$f":"IF('4'!$D$16=0,0,IF('4'!$D$16<>4,1,0))","v":0}]
[]
[null,null,"(iii) Track Record"]
[]
[null,null,"Does the client demonstrate Good Corporate Citizenship?",null,null,null,null,null,null,null,null,null,null,null,null,null,null,null,null,null,null,null,null,null,null,"Y/N"]
[null,null,"Best \nPractice",null,null,"High Level of Good Corporate Citizenship: The client: (a) is well-regarded by all stakeholder groups; (b) systematically identifies the needs of all stakeholders through active consultation and an effective grievance mechanism (complaints procedure); and (c) actively strives to deliver and monitor local benefits. ",null,null,null,null,null,null,null,null,null,null,null,null,null,null,null,null,null,null,null,null,{"$f":"IF('4'!$D$18=0,0,IF('4'!$D$18<>1,1,0))","v":0}]
[null,null,"Good \nPractice",null,null,"Standard Level of Good Corporate Citizenship: The client: (a) is generally well-regarded by all stakeholder groups; (b) consults with relevant stakeholders; and has in place an effective grievance mechanism (complaints procedure); and (c) delivers local benefits. ",null,null,null,null,null,null,null,null,null,null,null,null,null,null,null,null,null,null,null,null,{"$f":"IF('4'!$D$18=0,0,IF('4'!$D$18<>2,1,0))","v":0}]
[null,null,"Satisfactory",null,null,"Limited Level of Good Corporate Citizenship: There is: (a) evidence of complaints against the client in the past two years and the management response is largely reactive; (b) the needs of stakeholders are addressed in an ad hoc manner and an effective grievance mechanism has not been implemented; and/or (c) the client does not seek to deliver local benefits. ",null,null,null,null,null,null,null,null,null,null,null,null,null,null,null,null,null,null,null,null,{"$f":"IF('4'!$D$18=0,0,IF('4'!$D$18<>3,1,0))","v":0}]
[null,null,"Deficient",null,null,"Poor Level of Good Corporate Citizenship: There is evidence that the client has a poor relationship with many stakeholder groups and has been subject to negative media campaigns and boycotts. The client does not demonstrate any attempt to address E&S issues. The client does not recognise a need to deliver any local benefits. ",null,null,null,null,null,null,null,null,null,null,null,null,null,null,null,null,null,null,null,null,{"$f":"IF('4'!$D$18=0,0,IF('4'!$D$18<>4,1,0))","v":0}]
[]
[null,null,"What is the client's track record with regards to Occupational Health and Safety (OH&S)?",null,null,null,null,null,null,null,null,null,null,null,null,null,null,null,null,null,null,null,null,null,null,"Y/N"]
[null,null,"Best \nPractice",null,null,"Strong OH&S Track Record: Injury and accident rates are low and/or are lower relative to peers and/or show consistent decline over time. Emergency responses to incidents and accidents is rapid, and appropriate lessons are learned and applied effectively. Management have developed improvement plans to reduce the risks of accident for high risk OH&S areas.",null,null,null,null,null,null,null,null,null,null,null,null,null,null,null,null,null,null,null,null,{"$f":"IF('4'!$D$19=0,0,IF('4'!$D$19<>1,1,0))","v":0}]
[null,null,"Good \nPractice",null,null,"Average OH&S Track Record: Injury and accident rates remain stable or are lower than last year. Emergency response planning and capacity is evident.",null,null,null,null,null,null,null,null,null,null,null,null,null,null,null,null,null,null,null,null,{"$f":"IF('4'!$D$19=0,0,IF('4'!$D$19<>2,1,0))","v":0}]
[null,null,"Satisfactory",null,null,"Poor OH&S Track Record: Accident/injury rates are high and/or do not demonstrate a declining trend. Limited emergency response planning or capacity is evident.",null,null,null,null,null,null,null,null,null,null,null,null,null,null,null,null,null,null,null,null,{"$f":"IF('4'!$D$19=0,0,IF('4'!$D$19<>3,1,0))","v":0}]
[null,null,"Deficient",null,null,"Very Poor OH&S Track Record: Accident/injury rates are high and increasing and/or no accident statistics are made available for review. No emergency response capacity is evident. ",null,null,null,null,null,null,null,null,null,null,null,null,null,null,null,null,null,null,null,null,{"$f":"IF('4'!$D$19=0,0,IF('4'!$D$19<>4,1,0))","v":0}]
[]
[null,null,"Does the client comply with Environmental and Social (E&S) Laws and Regulations?",null,null,null,null,null,null,null,null,null,null,null,null,null,null,null,null,null,null,null,null,null,null,"Y/N"]
[null,null,"Best \nPractice",null,null,"Full Compliance with Relevant E&S Laws and Regulations: No evidence of punitive fines or penalties in the past two years. Evidence of active management oversight to ensure continued compliance with relevant E&S laws and regulations.",null,null,null,null,null,null,null,null,null,null,null,null,null,null,null,null,null,null,null,null,{"$f":"IF('4'!$D$20=0,0,IF('4'!$D$20<>1,1,0))","v":0}]
[null,null,"Good \nPractice",null,null,"Generally Compliant with Relevant E&S Laws and Regulations: The client may have been subject to fines or penalties in past two years, but these have been minor in nature and management action has been taken to address deficiencies. ",null,null,null,null,null,null,null,null,null,null,null,null,null,null,null,null,null,null,null,null,{"$f":"IF('4'!$D$20=0,0,IF('4'!$D$20<>2,1,0))","v":0}]
[null,null,"Satisfactory",null,null,"Limited Compliance with Relevant E&S Laws and Regulations: The client has been fined or sanctioned in the last two years (for minor and/or more significant failings) but demonstrates limited management oversight/capacity to address deficiencies in a systematic fashion.",null,null,null,null,null,null,null,null,null,null,null,null,null,null,null,null,null,null,null,null,{"$f":"IF('4'!$D$20=0,0,IF('4'!$D$20<>3,1,0))","v":0}]
[null,null,"Deficient",null,null,"Non-Compliance with Relevant E&S Laws and Regulations: Regular and systemic breaches of E&S laws and regulation resulting in punitive fines and penalties with no evidence to indicate management capacity or responsiveness to address deficiencies.",null,null,null,null,null,null,null,null,null,null,null,null,null,null,null,null,null,null,null,null,{"$f":"IF('4'!$D$20=0,0,IF('4'!$D$20<>4,1,0))","v":0}]
[]
[null,null,"How does the client report on Environmental and Social (E&S) issues?",null,null,null,null,null,null,null,null,null,null,null,null,null,null,null,null,null,null,null,null,null,null,"Y/N"]
[null,null,"Best \nPractice",null,null,"Strong E&S Reporting: The client publicly reports on its E&S performance using widely accepted metrics (e.g. Global Reporting Initiative or industry recognised sustainability reporting guidelines). E&S Reporting: (a) focuses on material issues; (b) demonstrates progress against stated performance objectives (e.g. SMART targets); (c) includes E&S performance of Third Parties; and (d) is assured by a third party (i.e. key E&S data sets).",null,null,null,null,null,null,null,null,null,null,null,null,null,null,null,null,null,null,null,null,{"$f":"IF('4'!$D$21=0,0,IF('4'!$D$21<>1,1,0))","v":0}]
[null,null,"Good \nPractice",null,null,"Adequate E&S Reporting: The client monitors and publicly reports on E&S performance covering all of its operations with defined key performance indicators (e.g. lost time injury rates and tonnes of carbon dioxide equivalent).  ",null,null,null,null,null,null,null,null,null,null,null,null,null,null,null,null,null,null,null,null,{"$f":"IF('4'!$D$21=0,0,IF('4'!$D$21<>2,1,0))","v":0}]
[null,null,"Satisfactory",null,null,"Limited E&S Reporting: Limited external reporting/disclosure of E&S performance. E&S reporting is collated internally, monitored and reported to senior management.",null,null,null,null,null,null,null,null,null,null,null,null,null,null,null,null,null,null,null,null,{"$f":"IF('4'!$D$21=0,0,IF('4'!$D$21<>3,1,0))","v":0}]
[null,null,"Deficient",null,null,"No E&S Reporting: The client does not report on E&S performance internally or externally.",null,null,null,null,null,null,null,null,null,null,null,null,null,null,null,null,null,null,null,null,{"$f":"IF('4'!$D$21=0,0,IF('4'!$D$21<>4,1,0))","v":0}]
[]
[null,null,"To what extent does the client manage labour relations?  ",null,null,null,null,null,null,null,null,null,null,null,null,null,null,null,null,null,null,null,null,null,null,"Y/N"]
[null,null,"Best \nPractice",null,null,"The client adheres to all national labour codes, the International Labour Organisation's conventions and recommendations, equality and diversity in the work force is promoted and there is at least one woman on the board.  There is a developed plan for training and the career development of employees, which all full time staff are entitled to.  The company solicits feedback from employees on how they perceive working for the company and there are clear grievance mechanisms for employees.",null,null,null,null,null,null,null,null,null,null,null,null,null,null,null,null,null,null,null,null,{"$f":"IF('4'!$D$22=0,0,IF('4'!$D$22<>1,1,0))","v":0}]
[null,null,"Good \nPractice",null,null,"The client adheres to all national labour codes, equality and diversity in the work force is promoted.  There is some training and career development of employees.  There are some grievance mechanisms for employees.",null,null,null,null,null,null,null,null,null,null,null,null,null,null,null,null,null,null,null,null,{"$f":"IF('4'!$D$22=0,0,IF('4'!$D$22<>2,1,0))","v":0}]
[null,null,"Satisfactory",null,null,"The client adheres to some national labour codes.  Equality and diversity in the work force is beginning to be considered.  Employees have sporadic training and development opportunities.  There are informal grievance mechanisms in place.",null,null,null,null,null,null,null,null,null,null,null,null,null,null,null,null,null,null,null,null,{"$f":"IF('4'!$D$22=0,0,IF('4'!$D$22<>3,1,0))","v":0}]
[null,null,"Deficient",null,null,"The client does not adhere to national labour codes.  Little regard is paid to equality and diversity in the work force.  Employees have few opportunities in the way of training and professional development.  There are no grievance mechanisms in place.",null,null,null,null,null,null,null,null,null,null,null,null,null,null,null,null,null,null,null,null,{"$f":"IF('4'!$D$22=0,0,IF('4'!$D$22<>4,1,0))","v":0}]
[]
[null,null,"To what extent does the client actively manage community investment activities?",null,null,null,null,null,null,null,null,null,null,null,null,null,null,null,null,null,null,null,null,null,null,"Y/N"]
[null,null,"Best \nPractice",null,null,"The client: (a) has a defined community investment strategy that links to the core business strategy; (b) understands the benefit of this strategy to itself and to its stakeholders; (c) measures the monetary value of its community investment activities including cash donation and in-kind giving (for example, employee volunteering during paid working hours, sponsoring apprenticeships or product or service donations); and (d) measures the impact and the effectiveness of its community investment activities.",null,null,null,null,null,null,null,null,null,null,null,null,null,null,null,null,null,null,null,null,{"$f":"IF('4'!$D$23=0,0,IF('4'!$D$23<>1,1,0))","v":0}]
[null,null,"Good \nPractice",null,null,"The client: (a) has a defined community investment strategy; and (b) measures the monetary value of its community investment activities including cash donation and in-kind giving (for example, employee volunteering during paid working hours or product/service donations/sponsoring apprenticeships).",null,null,null,null,null,null,null,null,null,null,null,null,null,null,null,null,null,null,null,null,{"$f":"IF('4'!$D$23=0,0,IF('4'!$D$23<>2,1,0))","v":0}]
[null,null,"Satisfactory",null,null,"The client: (a) actively supports community investment activities but does not have a defined strategy; and (b) donates money to charities and supports some other community investment activities as and when they arise (for example donating prizes, sponsoring events, or allowing employees to volunteer during working hours).  ",null,null,null,null,null,null,null,null,null,null,null,null,null,null,null,null,null,null,null,null,{"$f":"IF('4'!$D$23=0,0,IF('4'!$D$23<>3,1,0))","v":0}]
[null,null,"Deficient",null,null,"Community investment activities are not actively managed by the company.  Employees and/or local sites are involved in charitable activities on an ad hoc, individual basis.",null,null,null,null,null,null,null,null,null,null,null,null,null,null,null,null,null,null,null,null,{"$f":"IF('4'!$D$23=0,0,IF('4'!$D$23<>4,1,0))","v":0}]
[]
[null,null,"Summary Chart"]

{"sheet":"5.SiteVisitChecklist","index":7,"n_rows":180,"n_cols":24,"rows_kept":180,"cut":false,"hidden":false,"merged":[[0,21,2,27],[62,19,62,25],[70,19,70,25],[78,19,78,25],[91,19,91,25],[63,19,68,25],[79,19,89,25],[71,19,76,25],[18,2,18,11],[13,2,13,25],[15,2,15,25],[27,2,27,15],[66,2,66,15],[65,2,65,15],[64,2,64,15],[63,2,63,15],[68,2,68,15],[67,2,67,15],[55,2,55,15],[52,2,52,15],[51,2,51,15],[50,2,50,15],[36,2,36,15],[35,2,35,15],[34,2,34,15],[92,19,95,25],[131,19,135,25],[143,19,143,25],[11,2,11,25],[130,2,130,15],[124,2,124,15],[143,2,143,15],[22,2,22,15],[31,2,31,15],[94,2,94,15],[93,2,93,15],[74,2,74,15],[73,2,73,15],[72,2,72,15],[71,2,71,15],[89,2,89,15],[79,2,79,15],[76,2,76,15],[22,19,22,25],[31,19,31,25],[23,2,23,15],[29,2,29,15],[28,2,28,15],[158,19,158,25],[165,19,165,25],[166,19,173,25],[159,19,163,25],[152,19,156,25],[144,19,147,25],[99,19,99,25],[107,19,107,25],[115,19,115,25],[124,19,124,25],[130,19,130,25],[137,19,137,25],[125,19,126,25],[138,19,141,25],[116,19,122,25],[108,19,113,25],[100,19,105,25],[151,19,151,25],[33,2,33,15],[70,2,70,15],[78,2,78,15],[91,2,91,15],[81,2,81,15],[80,2,80,15],[23,19,29,25],[32,2,32,15],[39,2,39,15],[62,2,62,15],[54,2,54,15],[32,19,37,25],[40,19,52,25],[55,19,58,25],[54,19,54,25],[39,19,39,25],[49,2,49,15],[48,2,48,15],[47,2,47,15],[46,2,46,15],[45,2,45,15],[37,2,37,15],[44,2,44,15],[43,2,43,15],[42,2,42,15],[41,2,41,15],[40,2,40,15],[58,2,58,15],[57,2,57,15],[56,2,56,15],[101,2,101,15],[100,2,100,15],[95,2,95,15],[75,2,75,15],[87,2,87,15],[86,2,86,15],[85,2,85,15],[84,2,84,15],[83,2,83,15],[82,2,82,15],[92,2,92,15],[88,2,88,15],[111,2,111,15],[110,2,110,15],[109,2,109,15],[108,2,108,15],[105,2,105,15],[104,2,104,15],[107,2,107,15],[102,2,102,15],[99,2,99,15],[103,2,103,15],[119,2,119,15],[118,2,118,15],[116,2,116,15],[113,2,113,15],[112,2,112,15],[115,2,115,15],[126,2,126,15],[125,2,125,15],[122,2,122,15],[121,2,121,15],[120,2,120,15],[117,2,117,15],[135,2,135,15],[134,2,134,15],[133,2,133,15],[132,2,132,15],[131,2,131,15],[144,2,144,15],[141,2,141,15],[140,2,140,15],[139,2,139,15],[138,2,138,15],[137,2,137,15],[172,2,172,15],[171,2,171,15],[170,2,170,15],[169,2,169,15],[153,2,153,15],[152,2,152,15],[147,2,147,15],[146,2,146,15],[145,2,145,15],[161,2,161,15],[160,2,160,15],[159,2,159,15],[156,2,156,15],[155,2,155,15],[154,2,154,15],[165,2,165,15],[158,2,158,15],[151,2,151,15],[17,2,17,25],[179,2,179,25],[177,2,177,25],[4,2,4,5],[6,2,6,5],[6,7,6,9],[4,7,4,9],[6,23,6,25],[4,23,4,25],[6,19,6,21],[4,19,4,21],[4,15,4,17],[6,15,6,17],[4,11,4,13],[6,11,6,13],[26,2,26,15],[25,2,25,15],[24,2,24,15],[168,2,168,15],[167,2,167,15],[166,2,166,15],[163,2,163,15],[162,2,162,15],[173,2,173,15]]}
[null,null,null,null,null,null,null,null,null,null,null,null,null,null,null,null,null,null,null,null,null,"NOT REQUIRED FOR \nSPECIFIED TRANSACTION"]
[null,"5. Site Visit Checklist"]
[]
[]
[null,null,"Navigate \nto section",null,null,null,null,"Safety",null,null,null,"Health",null,null,null,"Environment",null,null,null,"Labour and \nHuman Rights",null,null,null,"Community"]
[null,null,null,null,null,null,null,{"$f":"(COUNTIF($R$24:$Z$30,\"*\")+COUNTIF($R$33:$Z$38,\"*\")+COUNTIF($R$41:$Z$53,\"*\")+COUNTIF($R$56:$Z$59,\"*\"))  /  COUNTIF($C$23:$C$59,\"*\")","v":0},null,null,null,{"$f":"(COUNTIF($R$64:$Z$69,\"*\")+COUNTIF($R$72:$Z$77,\"*\")+COUNTIF($R$80:$Z$90,\"*\")+COUNTIF($R$93:$Z$96,\"*\"))  /  COUNTIF($C$63:$P$96,\"*\")","v":0},null,null,null,{"$f":"(COUNTIF($R$101:$Z$106,\"*\")+COUNTIF($R$109:$Z$114,\"*\")+COUNTIF($R$117:$Z$123,\"*\")+COUNTIF($R$126:$Z$127,\"*\"))  /  COUNTIF($C$100:$C$127,\"*\")","v":0},null,null,null,{"$f":"(COUNTIF($R$132:$Z$136,\"*\")+COUNTIF($R$139:$Z$142,\"*\")+COUNTIF($R$145:$Z$148,\"*\"))  /  COUNTIF($C$131:$C$148,\"*\")","v":0},null,null,null,{"$f":"(COUNTIF($R$153:$Z$157,\"*\")+COUNTIF($R$160:$Z$164,\"*\")+COUNTIF($R$167:$Z$174,\"*\"))  /  COUNTIF($C$152:$C$174,\"*\")","v":0}]
[null,null,"% progress",null,null,null,null,{"$f":"IF(Ctrl_5=\"OFF\",\"n/a\",      IF(H6=1,\"Complete\",H6)     )","v":0},null,null,null,{"$f":"IF(Ctrl_5=\"OFF\",\"n/a\",      IF(L6=1,\"Complete\",L6)     )","v":0},null,null,null,{"$f":"IF(Ctrl_5=\"OFF\",\"n/a\",      IF(P6=1,\"Complete\",P6)     )","v":0},null,null,null,{"$f":"IF(Ctrl_5=\"OFF\",\"n/a\",      IF(T6=1,\"Complete\",T6)     )","v":0},null,null,null,{"$f":"IF(Ctrl_5=\"OFF\",\"n/a\",      IF(X6=1,\"Complete\",X6)     )","v":0}]
[]
[]
[null,null,"Introduction"]
[]
[null,null,"This tab will help you to appreciate what to look out for, from an environmental and social (E&S) risk perspective, during an operational site visit. On site you will be looking out for safety, environmental, health, labour and community issues. This will involve not only what you view while you are walking around the site, but also what is being monitored and recorded by management. This checklist is divided into hazards, documentation, risk avoidance and mitigation, and (where appropriate) protection sections."]
[]
[null,null,"For documentation, check that policies and procedures exist, which are designed to ensure that risks are identified and controlled. You should then look for evidence of how those risks are either avoided, or if they can’t be avoided, mitigated and minimised. Finally, check for measures that are in place to protect people and the environment from any residual risk."]
[]
[null,null,"Please provide comments where you identify that there is an issue. "]
[]
[null,null,"For further information, please refer to the ‘Site Visit Checklist & Guidance’ document available on the EBRD E-Manual wesite:"]
[null,null,"http://www.ebrd.com/environment/e-manual/af6guide.html"]
[]
[null,null,"(i) Safety"]
[]
[null,null,"Which hazards/issues (either actual or potential) can you see on site?",null,null,null,null,null,null,null,null,null,null,null,null,null,null,"Y/N",null,"Comments"]
[null,null,"Falls from height"]
[null,null,"Movement of vehicles"]
[null,null,"Road safety"]
[null,null,"Confined spaces"]
[null,null,"Fire safety"]
[null,null,"Excavation safety"]
[null,null,"Other"]
[]
[null,null,"Documentation:",null,null,null,null,null,null,null,null,null,null,null,null,null,null,"Y/N",null,"Comments"]
[null,null,"Is there a Health and Safety Policy in place?"]
[null,null,"Is there a H&S notice board with information on fire wardens and first aiders?"]
[null,null,"Have permits to work been obtained if necessary?"]
[null,null,"Are there records showing that equipment is regularly inspected and maintained?"]
[null,null,"Are there records which show that training has been provided for those carrying out potentially hazardous activities?"]
[null,null,"Have any potential sources of ignition been identified?"]
[]
[null,null,"Risk Avoidance and Mitigation:",null,null,null,null,null,null,null,null,null,null,null,null,null,null,"Y/N",null,"Comments"]
[null,null,"Is the site generally clean, tidy and kept free of trip hazards?"]
[null,null,"Are vehicles and pedestrians kept separate?"]
[null,null,"Are vehicle windscreens, mirrors and lights clean and in good working condition?"]
[null,null,"Are banksmen provided to help drivers?"]
[null,null,"Are hazardous and/or flammable materials stored safely?"]
[null,null,"Is the release of dangerous substances controlled at source? Is sufficient ventilation provided?"]
[null,null,"Have excavation sides been supported effectively? Are vehicles and heavy materials kept away from the edges?"]
[null,null,"Are ladders fastened at the top and bottom?"]
[null,null,"Are fixed guard rails in place to prevent a fall?"]
[null,null,"Are workers being supervised?"]
[null,null,"Is gas detection equipment being used to monitor confined spaces?"]
[null,null,"Are excavations suitably illuminated?"]
[null,null,"Are excavations dry with no damaged services running through?"]
[]
[null,null,"Protection:",null,null,null,null,null,null,null,null,null,null,null,null,null,null,"Y/N",null,"Comments"]
[null,null,"Is PPE readily available and in use?"]
[null,null,"Is there appropriate signage showing when PPE should be used?"]
[null,null,"Is the correct PPE being used where needed? E.g. harnesses with double lanyards for people working at height; high visibility jackets for people working near vehicles; breathing apparatus for people working in confined spaces."]
[null,null,"Is firefighting equipment available in working areas?"]
[]
[null,null,"(ii) Health"]
[]
[null,null,"Which hazards/issues (either actual or potential) can you see on site?",null,null,null,null,null,null,null,null,null,null,null,null,null,null,"Y/N",null,"Comments"]
[null,null,"Physical (e.g. noise, dust, fumes, asbestos, wet-working, vibration, manual handling etc.)"]
[null,null,"Chemical"]
[null,null,"Biological"]
[null,null,"Radiation"]
[null,null,"Psychosocial (noise, poor lighting, thermal comfort etc.)"]
[null,null,"Other"]
[]
[null,null,"Documentation:",null,null,null,null,null,null,null,null,null,null,null,null,null,null,"Y/N",null,"Comments"]
[null,null,"Has a risk assessment been carried out for the handling of or exposure to dangerous substances?"]
[null,null,"Has a noise assessment been carried out and is noise monitored in work areas?"]
[null,null,"Is there evidence of air quality monitoring?"]
[null,null,"Is there an asbestos management plan in place?"]
[null,null,"Are there records of the relevant authorities being notified if radiation is used?"]
[null,null,"Is there evidence of noise assessments having been undertaken?"]
[]
[null,null,"Risk Avoidance and Mitigation:",null,null,null,null,null,null,null,null,null,null,null,null,null,null,"Y/N",null,"Comments"]
[null,null,"Is the working environment clean in general?"]
[null,null,"Is there sufficient ventilation to prevent working in dust or fume laden air?"]
[null,null,"Is noisy equipment enclosed or are acoustic barriers in place?"]
[null,null,"Are there hoods over cutting devices?"]
[null,null,"Does the site appear to be free from asbestos?"]
[null,null,"Are there washing facilities to prevent hand to mouth/eye transfer?"]
[null,null,"Are harmful substances disposed of safely?"]
[null,null,"Are hazardous materials stored in designated labelled containers when in use?"]
[null,null,"Is the site free from vermin?"]
[null,null,"Are workers operating with enough space and light?"]
[null,null,"Is there sufficient heating/cooling of indoor environments?"]
[]
[null,null,"Protection:",null,null,null,null,null,null,null,null,null,null,null,null,null,null,"Y/N",null,"Comments"]
[null,null,"Is PPE used to prevent contact of harmful substances with the skin, eyes or respiratory system? For example, gloves, masks and protective glasses."]
[null,null,"Is hearing protection used in noisy working environments?"]
[null,null,"Is hand protection used where needles or sharps risks are present?"]
[null,null,"Are workers provided with suitable warm and wet weather clothing? "]
[]
[null,null,"(iii) Environment"]
[]
[null,null,"Which hazards/issues (either actual or potential) can you see on site?",null,null,null,null,null,null,null,null,null,null,null,null,null,null,"Y/N",null,"Comments"]
[null,null,"Contaminated land"]
[null,null,"Waste water"]
[null,null,"Air emissions"]
[null,null,"Waste management"]
[null,null,"Biodiversity"]
[null,null,"Other"]
[]
[null,null,"Documentation:",null,null,null,null,null,null,null,null,null,null,null,null,null,null,"Y/N",null,"Comments"]
[null,null,"Is there an adequate Environmental Policy in place?"]
[null,null,"Are any specialist reports available examining the site’s geology and history from a potential contamination viewpoint?"]
[null,null,"Are there emissions/water discharge permits? Can you confirm that permitted emissions levels have not been exceeded? "]
[null,null,"Are underground installations such as storage tanks and sewer systems, where present, inspected regularly?"]
[null,null,"Has an environmental risk assessment been carried out?"]
[null,null,"Is there monitoring of habitats and species that have been translocated?"]
[]
[null,null,"Risk Avoidance and Mitigation:",null,null,null,null,null,null,null,null,null,null,null,null,null,null,"Y/N",null,"Comments"]
[null,null,"Is there any past and present known contamination to soils or groundwater associated with the site, either through company activities or migrations from other sites?"]
[null,null,"Is the site free from evidence of leaks or spills around storage tanks/areas and process equipment?"]
[null,null,"Is the site clear of any pools or puddles or stagnant water?"]
[null,null,"Is waste water discharged away from water courses?"]
[null,null,"If there are significant air emissions, is there evidence of the treatment of those emissions?"]
[null,null,"Have efforts been made to ‘reduce, reuse or recycle’ waste in the first instance?"]
[null,null,"Is there adequate on-site storage of waste? Is the site generally clean and free from waste?"]
[]
[null,null,"Protection:",null,null,null,null,null,null,null,null,null,null,null,null,null,null,"Y/N",null,"Comments"]
[null,null,"Is there adequate protection, such as secondary containment, around storage tanks?"]
[null,null,"Are hazardous materials stored safely – e.g. in locked cages, and away from potential vehicle collision damage?"]
[]
[null,null,"(iv) Labour and Human Rights"]
[]
[null,null,"Which hazards/issues (either actual or potential) can you identify from your site visit?",null,null,null,null,null,null,null,null,null,null,null,null,null,null,"Y/N",null,"Comments"]
[null,null,"Migrant labour"]
[null,null,"Poor working conditions"]
[null,null,"Child labour"]
[null,null,"Forced labour"]
[null,null,"Other"]
[]
[null,null,"Documentation:",null,null,null,null,null,null,null,null,null,null,null,null,null,null,"Y/N",null,"Comments"]
[null,null,"Do any migrant workers have the correct work permits?"]
[null,null,"Do contracts of work show that working hours, breaks and time off are all in line with local regulations?"]
[null,null,"Can the management confirm that employees are being paid a wage and are not working under debt obligations? "]
[null,null,"Can the management provide evidence to confirm the ages of the workforce?"]
[]
[null,null,"Risk Avoidance and Mitigation:",null,null,null,null,null,null,null,null,null,null,null,null,null,null,"Y/N",null,"Comments"]
[null,null,"Are workers provided with a safe and hygienic workplace?"]
[null,null,"Do workers appear to be able to leave the site of their own free will? Look out for accommodation on site or workers being transported to site."]
[null,null,"Is any worker accommodation clean and of sufficient quality?"]
[null,null,"Do all workers appear to be over the legal working age?"]
[]
[null,null,"(v) Community"]
[]
[null,null,"Which issues have (or could potentially have) an impact on the local community?",null,null,null,null,null,null,null,null,null,null,null,null,null,null,"Y/N",null,"Comments"]
[null,null,"Safety – Does the site activity mean that the community cannot operate safely? Could an explosion or other such incident at the site affect the community?"]
[null,null,"Environment – Do the activities on the site impact the local environment?"]
[null,null,"Nuisance – Is there disruption to the community (e.g. noise, smell, vehicle movements)?"]
[null,null,"Security personnel – Do they pose a risk to the community?"]
[null,null,"Other"]
[]
[null,null,"Documentation:",null,null,null,null,null,null,null,null,null,null,null,null,null,null,"Y/N",null,"Comments"]
[null,null,"Is there a policy in place related to community/stakeholder relations or community investment? "]
[null,null,"Is there appropriate public liability insurance policy in place?"]
[null,null,"Can management provide documentation showing that security personnel have been checked for involvement in past abuse and have been trained on how to interact with the community?"]
[null,null,"Is there a documented method for complaints to be logged?"]
[null,null,"Has the company conducted a study to assess the likely impact of an explosion, gas leak, etc. if relevant?"]
[]
[null,null,"Risk Avoidance and Mitigation:",null,null,null,null,null,null,null,null,null,null,null,null,null,null,"Y/N",null,"Comments"]
[null,null,"Is public access to the site and equipment limited?"]
[null,null,"If site operations could create a fire/explosion/flood, has this risk been controlled? How?"]
[null,null,"Is there provision to contain any firefighting water run-off?"]
[null,null,"Have spills and leaks which may impact upon the community been prevented?"]
[null,null,"Are vehicle movements and timings considerate to the local community?"]
[null,null,"Is the site free from any strong odours or significant noise/dust which may affect the local community?"]
[null,null,"Is the site located away from residential areas?"]
[null,null,"Can management confirm that there is a good relationship with the local community?"]
[]
[null,null,"Disclaimer:"]
[]
[null,null,"Note that this guidance only covers a number of commonly found E&S risks and issues you may find during a site visit. This is not an exhaustive list of E&S risks and issues, and you should look out for potential risks that are not outlined here."]
[]
[null,null,"This guidance does not provide detailed technical information on the issues identified, but provides you with some key questions to ask, to understand how a customer is managing E&S risks. In addition to this guidance, you should review EBRD’s Sub-sectoral guidelines for more information. Where you have concerns about conducting an operational site visit, you may wish to use a specialist E&S consultancy to support you."]

{"sheet":"6.Summary","index":8,"n_rows":21,"n_cols":22,"rows_kept":21,"cut":false,"hidden":false,"merged":[[21,3,21,25],[3,2,3,26],[8,21,8,25],[12,21,12,25],[8,3,12,19],[7,21,7,25],[11,21,11,25],[17,3,17,25]]}
[]
[null,"6. Summary"]
[]
[null,null,"Use the boxes below to summarise your key findings from this E&S risk assessment. Provide commentary on the level of inherent risk, and the management therefore, and use the evidence that you have collected throughout the due diligence process to form your own view of the E&S risk associated with the specified transaction. Enter your final (user-assessed) E&S risk rating in the box provided. Additional comments boxes are also provided to capture any specific recommendations for credit committee (e.g. on conditions precedent, collateral, or loan monitoring, etc.) and any other feedback received during the review process."]
[]
[null,null,"(i) Transaction risk"]
[]
[null,null,null,"Overview of E&S risk (incl. justification of the final user-assessed risk rating)",null,null,null,null,null,null,null,null,null,null,null,null,null,null,null,null,null,"Inherent E&S Risk"]
[null,null,null,null,null,null,null,null,null,null,null,null,null,null,null,null,null,null,null,null,null,{"$f":"OverallRiskScore","v":"{-}"}]
[]
[]
[null,null,null,null,null,null,null,null,null,null,null,null,null,null,null,null,null,null,null,null,null,"User-Assessed E&S Risk"]
[null,null,null,null,null,null,null,null,null,null,null,null,null,null,null,null,null,null,null,null,null,"{Please select}"]
[]
[null,null,"(ii) Recommendations and feedback"]
[]
[null,null,null,"Recommendations for credit committee"]
[]
[]
[]
[null,null,null,"Feedback, post-review"]

{"sheet":"7.DDReport","index":9,"n_rows":447,"n_cols":27,"rows_kept":447,"cut":false,"hidden":false,"merged":[[18,21,18,25],[19,3,23,19],[19,21,19,25],[22,21,22,25],[23,21,23,25],[28,3,28,25],[32,3,32,25],[14,1,14,26],[126,3,126,25],[79,3,79,25],[80,3,80,25],[87,19,87,20],[88,19,88,20],[91,11,92,13],[91,15,92,17],[91,19,92,21],[83,2,83,26],[86,11,86,13],[86,15,86,17],[86,19,86,21],[86,23,86,25],[91,3,91,5],[60,6,60,16],[127,3,127,9],[135,2,135,17],[135,21,137,25],[136,2,136,17],[137,2,137,17],[145,2,145,17],[145,21,149,25],[146,2,146,17],[147,2,147,17],[148,2,148,17],[149,2,149,17],[127,10,127,20],[142,2,142,17],[142,21,142,25],[158,12,158,16],[158,18,158,22],[156,6,156,10],[156,12,156,16],[40,12,40,25],[41,12,41,25],[42,12,42,25],[43,12,43,25],[44,12,44,25],[45,12,45,25],[55,22,55,25],[56,22,56,25],[57,22,57,25],[60,22,60,25],[72,14,72,17],[72,18,72,21],[73,8,73,9],[73,10,73,13],[73,14,73,17],[73,18,73,21],[74,8,74,21],[91,23,92,25],[92,3,92,10],[78,3,78,25],[187,2,187,4],[187,5,187,23],[188,2,188,4],[188,5,188,23],[189,2,189,4],[189,5,189,23],[61,22,61,25],[62,22,62,25],[66,2,66,26],[70,7,73,7],[70,8,70,9],[70,10,70,13],[70,14,70,17],[70,18,70,21],[71,8,71,9],[71,10,71,13],[71,14,71,17],[71,18,71,21],[72,8,72,9],[72,10,72,13],[186,2,186,23],[158,6,158,10],[62,6,62,16],[61,6,61,16],[194,2,194,4],[194,5,194,23],[195,2,195,4],[195,5,195,23],[196,2,196,4],[196,5,196,23],[190,2,190,4],[190,5,190,23],[192,2,192,23],[193,2,193,4],[193,5,193,23],[201,2,201,4],[201,5,201,23],[202,2,202,4],[202,5,202,23],[204,2,204,23],[198,2,198,23],[199,2,199,4],[199,5,199,23],[200,2,200,4],[200,5,200,23],[208,2,208,4],[208,5,208,23],[212,2,212,23],[213,2,213,4],[213,5,213,23],[205,2,205,4],[205,5,205,23],[206,2,206,4],[206,5,206,23],[207,2,207,4],[207,5,207,23],[218,2,218,23],[219,2,219,4],[219,5,219,23],[220,2,220,4],[220,5,220,23],[214,2,214,4],[214,5,214,23],[215,2,215,4],[215,5,215,23],[216,2,216,4],[216,5,216,23],[225,2,225,4],[225,5,225,23],[226,2,226,4],[226,5,226,23],[227,2,227,4],[227,5,227,23],[221,2,221,4],[221,5,221,23],[222,2,222,4],[222,5,222,23],[224,2,224,23],[232,2,232,4],[232,5,232,23],[233,2,233,4],[233,5,233,23],[234,2,234,4],[234,5,234,23],[228,2,228,4],[228,5,228,23],[230,2,230,23],[231,2,231,4],[231,5,231,23],[241,2,241,4],[241,5,241,23],[242,2,242,4],[242,5,242,23],[244,2,244,23],[238,2,238,23],[239,2,239,4],[239,5,239,23],[240,2,240,4],[240,5,240,23],[250,2,250,23],[251,2,251,4],[251,5,251,23],[245,2,245,4],[245,5,245,23],[246,2,246,4],[246,5,246,23],[247,2,247,4],[247,5,247,23],[263,2,263,4],[263,5,263,23],[264,2,264,4],[264,5,264,23],[265,2,265,4],[265,5,265,23],[259,2,259,4],[259,5,259,23],[260,2,260,4],[260,5,260,23],[262,2,262,23],[270,2,270,4],[270,5,270,23],[271,2,271,4],[271,5,271,23],[272,2,272,4],[272,5,272,23],[266,2,266,4],[266,5,266,23],[268,2,268,23],[269,2,269,4],[269,5,269,23],[281,21,281,23],[281,5,281,7],[281,9,281,11],[281,13,281,15],[281,17,281,19],[156,18,156,22],[279,5,279,7],[279,9,279,11],[279,13,279,15],[279,17,279,19],[279,21,279,23],[256,2,256,23],[257,2,257,4],[257,5,257,23],[258,2,258,4],[258,5,258,23],[252,2,252,4],[252,5,252,23],[253,2,253,4],[253,5,253,23],[254,2,254,4],[254,5,254,23],[248,2,248,4],[248,5,248,23],[287,2,287,15],[287,19,287,25],[288,2,288,15],[288,19,294,25],[289,2,289,15],[290,2,290,15],[291,2,291,15],[292,2,292,15],[293,2,293,15],[294,2,294,15],[296,2,296,15],[296,19,296,25],[297,2,297,15],[297,19,302,25],[298,2,298,15],[299,2,299,15],[300,2,300,15],[301,2,301,15],[302,2,302,15],[319,2,319,15],[319,19,319,25],[320,2,320,15],[320,19,323,25],[321,2,321,15],[322,2,322,15],[323,2,323,15],[304,2,304,15],[304,19,304,25],[305,2,305,15],[305,19,317,25],[306,2,306,15],[307,2,307,15],[308,2,308,15],[309,2,309,15],[310,2,310,15],[311,2,311,15],[312,2,312,15],[313,2,313,15],[314,2,314,15],[315,2,315,15],[316,2,316,15],[317,2,317,15],[327,2,327,15],[327,19,327,25],[328,2,328,15],[328,19,333,25],[329,2,329,15],[330,2,330,15],[331,2,331,15],[332,2,332,15],[333,2,333,15],[335,2,335,15],[335,19,335,25],[336,2,336,15],[336,19,341,25],[337,2,337,15],[338,2,338,15],[339,2,339,15],[340,2,340,15],[341,2,341,15],[356,2,356,15],[356,19,356,25],[357,2,357,15],[357,19,360,25],[358,2,358,15],[359,2,359,15],[360,2,360,15],[343,2,343,15],[343,19,343,25],[344,2,344,15],[344,19,354,25],[345,2,345,15],[346,2,346,15],[347,2,347,15],[348,2,348,15],[349,2,349,15],[350,2,350,15],[351,2,351,15],[352,2,352,15],[353,2,353,15],[354,2,354,15],[364,2,364,15],[364,19,364,25],[365,2,365,15],[365,19,370,25],[366,2,366,15],[367,2,367,15],[368,2,368,15],[369,2,369,15],[370,2,370,15],[372,2,372,15],[372,19,372,25],[373,2,373,15],[373,19,378,25],[374,2,374,15],[375,2,375,15],[376,2,376,15],[377,2,377,15],[378,2,378,15],[389,2,389,15],[389,19,389,25],[390,2,390,15],[390,19,391,25],[391,2,391,15],[380,2,380,15],[380,19,380,25],[381,2,381,15],[381,19,387,25],[383,2,383,15],[384,2,384,15],[385,2,385,15],[386,2,386,15],[387,2,387,15],[382,2,382,15],[412,2,412,15],[402,2,402,15],[402,19,402,25],[403,2,403,15],[403,19,406,25],[404,2,404,15],[405,2,405,15],[406,2,406,15],[395,2,395,15],[395,19,395,25],[396,2,396,15],[396,19,400,25],[397,2,397,15],[398,2,398,15],[399,2,399,15],[400,2,400,15],[408,2,408,15],[408,19,408,25],[409,2,409,15],[409,19,412,25],[410,2,410,15],[411,2,411,15],[446,2,446,25],[12,1,12,25],[430,2,430,15],[430,19,430,25],[431,2,431,15],[431,19,438,25],[432,2,432,15],[433,2,433,15],[434,2,434,15],[435,2,435,15],[436,2,436,15],[437,2,437,15],[438,2,438,15],[423,2,423,15],[423,19,423,25],[424,2,424,15],[424,19,428,25],[425,2,425,15],[426,2,426,15],[427,2,427,15],[50,2,50,26],[55,6,55,13],[56,6,56,13],[57,6,57,13],[444,2,444,25],[428,2,428,15],[416,2,416,15],[416,19,416,25],[417,2,417,15],[417,19,421,25],[418,2,418,15],[419,2,419,15],[420,2,420,15],[421,2,421,15]]}
[]
["E&S Due Diligence Report"]
[]
[null,{"$f":"IF(ClientName=\"\",\"[CustomerName]\",ClientName)","v":"[CustomerName]"}]
[]
[null,{"$f":"IF(AssessmentDate=0,\"[AssessmentDate]\",TEXT(AssessmentDate,\"dd mmmm yyyy\"))","v":"[AssessmentDate]"}]
[]
[]
[]
[]
[null,"Executive Summary"]
[]
[null,{"$f":"\"This report outlines the results of an E&S risk assessment of the environmental and social risks associated with\"\n&\nIF(LendingType=\"Equity_active\",\" an active equity investment in \",\nIF(LendingType=\"Equity_passive\",\" a passive equity investment in \",\n\" the provision of a \"     &\nIFERROR(     LOWER(LEFT(LengthOfLoan,FIND(\"(\",LengthOfLoan)-2))&\"-term \",     \"[Length] \")     &\nIF(LendingType=\"Corporate loan\",LOWER(LendingType),IF(LendingType=\"SME loan\",LendingType,\"[LendingType]\"))     &     \" to \"))     &\nIF(ISBLANK(ClientName),\"[CustomerName]\",ClientName)      &      \". \"\n&\n\"The risk assessment was conducted by \"     &\nIF(UserName=0,\"[UserName]\",UserName)    &     \" and the document was printed on \"     &\nIF(AssessmentDate=0,\"[AssessmentDate]\",TEXT(AssessmentDate,\"dd mmmm yyyy\"))     &      \".\"","v":"This report outlines the results of an E&S risk assessment of the environmental and social risks associated with the provision of a [Length] [LendingType] to [CustomerName]. The risk assessment was conducted by [UserName] and the document was printed on [AssessmentDate]."}]
[]
[null,"The key findings from the E&S due diligence process are summarised in the section below. This includes an overview of the inherent and perceived transaction risk, and the management therefore, together with specific recommendations for credit committee and additional feedback comments, post-review."]
[]
[null,null,"(i) Transaction risk"]
[]
[null,null,null,"Overview of E&S risk (incl. justification of the final user-assessed risk rating)",null,null,null,null,null,null,null,null,null,null,null,null,null,null,null,null,null,"Inherent E&S Risk"]
[null,null,null,{"$f":"IF('6.Summary'!D9=0,\"\",'6.Summary'!D9)","v":""},null,null,null,null,null,null,null,null,null,null,null,null,null,null,null,null,null,{"$f":"'6.Summary'!V9","v":"{-}"}]
[]
[]
[null,null,null,null,null,null,null,null,null,null,null,null,null,null,null,null,null,null,null,null,null,"User-Assessed E&S Risk"]
[null,null,null,null,null,null,null,null,null,null,null,null,null,null,null,null,null,null,null,null,null,{"$f":"'6.Summary'!V13","v":"{Please select}"}]
[]
[null,null,"(ii) Recommendations and feedback"]
[]
[null,null,null,"Recommendations for credit committee"]
[null,null,null,{"$f":"IF('6.Summary'!D18=0,\"\",'6.Summary'!D18)","v":""}]
[]
[]
[null,null,null,"Feedback, post-review"]
[null,null,null,{"$f":"IF('6.Summary'!D22=0,\"\",'6.Summary'!D22)","v":""}]
[]
[]
[null,"1. User Details"]
[]
[null,null,"User Details"]
[]
[]
[null,null,"Name of user",null,null,null,null,null,null,null,null,null,{"$f":"IF('1.UserDetails'!M9=0,\"\",'1.UserDetails'!M9)","v":""}]
[null,null,"FI name",null,null,null,null,null,null,null,null,null,{"$f":"IF('1.UserDetails'!M10=0,\"\",'1.UserDetails'!M10)","v":""}]
[null,null,"Branch name (if applicable)",null,null,null,null,null,null,null,null,null,{"$f":"IF('1.UserDetails'!M11=0,\"\",'1.UserDetails'!M11)","v":""}]
[null,null,"Position/Role",null,null,null,null,null,null,null,null,null,{"$f":"IF('1.UserDetails'!M12=0,\"\",'1.UserDetails'!M12)","v":""}]
[null,null,"Email address",null,null,null,null,null,null,null,null,null,{"$f":"IF('1.UserDetails'!M13=0,\"\",'1.UserDetails'!M13)","v":""}]
[null,null,"Contact number",null,null,null,null,null,null,null,null,null,{"$f":"IF('1.UserDetails'!M14=0,\"\",'1.UserDetails'!M14)","v":""}]
[]
[]
[null,"2. E&S Risk Assessment"]
[]
[null,null,"The section below outlines the inherent E&S risk associated with the specified transaction. This inherent risk is a function of the sector E&S risk and, where applicable, the length of the loan agreement. The overall E&S risk rating for the transaction is displayed in the E&S Risk Matrix. In addition, if the chosen sector carries a high or medium E&S risk rating, the key E&S issues present in the sector are outlined in the accompanying E&S Issue Table. (For low risk sectors, the E&S Issue Table is not displayed.)"]
[]
[null,null,"Transaction Details"]
[]
[]
[null,null,"Customer name",null,null,null,{"$f":"IF('2.RiskAssessment'!G9=0,\"\",'2.RiskAssessment'!G9)","v":""},null,null,null,null,null,null,null,null,null,null,"Transaction country",null,null,null,null,{"$f":"IF('2.RiskAssessment'!W9=0,\"\",'2.RiskAssessment'!W9)","v":"{Please select}"}]
[null,null,"Customer ID",null,null,null,{"$f":"IF('2.RiskAssessment'!G10=0,\"\",'2.RiskAssessment'!G10)","v":""},null,null,null,null,null,null,null,null,null,null,"Transaction type",null,null,null,null,{"$f":"IF('2.RiskAssessment'!W10=0,\"\",'2.RiskAssessment'!W10)","v":"{Please select}"}]
[null,null,"Assessment date",null,null,null,{"$f":"IF('2.RiskAssessment'!G11=0,\"\",'2.RiskAssessment'!G11)","v":""},null,null,null,null,null,null,null,null,null,null,"Length of loan",null,null,null,null,{"$f":"IF('2.RiskAssessment'!W11=0,\"\",'2.RiskAssessment'!W11)","v":"{Please select}"}]
[]
[]
[null,null,"Industry",null,null,null,{"$f":"IF('2.RiskAssessment'!G14=0,\"\",'2.RiskAssessment'!G14)","v":"{Please select}"},null,null,null,null,null,null,null,null,null,null,"NACE code1",null,null,null,null,{"$f":"IF('2.RiskAssessment'!W14=0,\"\",'2.RiskAssessment'!W14)","v":"{-}"}]
[null,null,"Category",null,null,null,{"$f":"IF('2.RiskAssessment'!G15=0,\"\",'2.RiskAssessment'!G15)","v":"{Please select}"},null,null,null,null,null,null,null,null,null,null,"Sector E&S Risk",null,null,null,null,{"$f":"IF('2.RiskAssessment'!W15=0,\"\",'2.RiskAssessment'!W15)","v":"{-}"},null,null,null,{"$f":"IFERROR(     MATCH(\" \",#REF!,0),     1)","v":1}]
[null,null,"Subcategory",null,null,null,{"$f":"IF('2.RiskAssessment'!G16=0,\"\",'2.RiskAssessment'!G16)","v":"{Please select}"},null,null,null,null,null,null,null,null,null,null,"Overall E&S Risk",null,null,null,null,{"$f":"IF('2.RiskAssessment'!W16=0,\"\",'2.RiskAssessment'!W16)","v":"{-}"}]
[]
[null,null,null,null,null,null,null,null,null,null,null,null,null,null,{"$f":"'2.RiskAssessment'!O18","v":"The selected activity is excluded from financing using EBRD funds – check your agreement with EBRD for details."}]
[]
[null,null,"E&S Risk Matrix"]
[]
[]
[]
[null,null,null,null,null,null,null,{"$f":"IF('2.RiskAssessment'!H23=0,\"\",'2.RiskAssessment'!H23)","v":"Length of Loan  ──────────────►"},{"$f":"IF('2.RiskAssessment'!I23=0,\"\",'2.RiskAssessment'!I23)","v":"Long"},null,{"$f":"IF('2.RiskAssessment'!K23=0,\"\",'2.RiskAssessment'!K23)","v":""},null,null,null,{"$f":"IF('2.RiskAssessment'!O23=0,\"\",'2.RiskAssessment'!O23)","v":""},null,null,null,{"$f":"IF('2.RiskAssessment'!S23=0,\"\",'2.RiskAssessment'!S23)","v":""}]
[null,null,null,null,null,null,null,null,{"$f":"IF('2.RiskAssessment'!I24=0,\"\",'2.RiskAssessment'!I24)","v":"Medium"},null,{"$f":"IF('2.RiskAssessment'!K24=0,\"\",'2.RiskAssessment'!K24)","v":""},null,null,null,{"$f":"IF('2.RiskAssessment'!O24=0,\"\",'2.RiskAssessment'!O24)","v":""},null,null,null,{"$f":"IF('2.RiskAssessment'!S24=0,\"\",'2.RiskAssessment'!S24)","v":""}]
[null,null,null,null,null,null,null,null,{"$f":"IF('2.RiskAssessment'!I25=0,\"\",'2.RiskAssessment'!I25)","v":"Short"},null,{"$f":"IF('2.RiskAssessment'!K25=0,\"\",'2.RiskAssessment'!K25)","v":""},null,null,null,{"$f":"IF('2.RiskAssessment'!O25=0,\"\",'2.RiskAssessment'!O25)","v":""},null,null,null,{"$f":"IF('2.RiskAssessment'!S25=0,\"\",'2.RiskAssessment'!S25)","v":""}]
[null,null,null,null,null,null,null,null,{"$f":"IF('2.RiskAssessment'!I26=0,\"\",'2.RiskAssessment'!I26)","v":""},null,{"$f":"IF('2.RiskAssessment'!K26=0,\"\",'2.RiskAssessment'!K26)","v":"Low"},null,{"$f":"IF('2.RiskAssessment'!M26=0,\"\",'2.RiskAssessment'!M26)","v":""},null,{"$f":"IF('2.RiskAssessment'!O26=0,\"\",'2.RiskAssessment'!O26)","v":"Medium"},null,{"$f":"IF('2.RiskAssessment'!Q26=0,\"\",'2.RiskAssessment'!Q26)","v":""},null,{"$f":"IF('2.RiskAssessment'!S26=0,\"\",'2.RiskAssessment'!S26)","v":"High"},null,{"$f":"IF('2.RiskAssessment'!U26=0,\"\",'2.RiskAssessment'!U26)","v":""}]
[null,null,null,null,null,null,null,null,{"$f":"IF('2.RiskAssessment'!I27=0,\"\",'2.RiskAssessment'!I27)","v":"Sector Risk Score  ──────────────────────────────────►"}]
[]
[]
[]
[null,null,"1","Business activities are ranked according to the EU statistical classification codes NACE Rev. 2 (based on the Regulation"]
[null,null,null,"(EC) No 1893/2006 of the European Parliament & of the Council, establishing the statistical classification of economic"]
[null,null,null,"activities NACE Rev. 2, adopted on 19 December 2006)."]
[]
[]
[null,null,"E&S Issue Table"]
[]
[]
[null,null,null,"E&S Risk Category",null,null,null,null,null,null,null,"Environment",null,null,null,"Health & Safety",null,null,null,"Labour",null,null,null,"Community"]
[]
[]
[]
[]
[null,null,null,"Key E&S Risks",null,null,{"$f":"IFERROR(      IF(INDEX(L_GuidelineStatus,MATCH(NACE,L_NACE,0))=\"Drafted\",2,\"\"),      \"\")","v":""},null,null,null,null,"Affect the natural environment",null,null,null,"Affect the health or safety of employees",null,null,null,"Affect workplace conditions and the treatment of employees",null,null,null,"Affect the health and safety, livelihoods, and environment of the community and wider public"]
[null,null,null,"(in order of materiality)"]
[]
[null,null,null,{"$f":"IF('2.RiskAssessment'!D412,\"\",'2.RiskAssessment'!D41)","v":" "},null,null,null,null,null,null,null,null,{"$f":"IF('2.RiskAssessment'!M41=0,\"\",'2.RiskAssessment'!M41)","v":""},null,null,null,{"$f":"IF('2.RiskAssessment'!Q41=0,\"\",'2.RiskAssessment'!Q41)","v":""},null,null,null,{"$f":"IF('2.RiskAssessment'!U41=0,\"\",'2.RiskAssessment'!U41)","v":""},null,null,null,{"$f":"IF('2.RiskAssessment'!Y41=0,\"\",'2.RiskAssessment'!Y41)","v":""}]
[null,null,null,{"$f":"IF('2.RiskAssessment'!D413,\"\",'2.RiskAssessment'!D42)","v":" "},null,null,null,null,null,null,null,null,{"$f":"IF('2.RiskAssessment'!M42=0,\"\",'2.RiskAssessment'!M42)","v":""},null,null,null,{"$f":"IF('2.RiskAssessment'!Q42=0,\"\",'2.RiskAssessment'!Q42)","v":""},null,null,null,{"$f":"IF('2.RiskAssessment'!U42=0,\"\",'2.RiskAssessment'!U42)","v":""},null,null,null,{"$f":"IF('2.RiskAssessment'!Y42=0,\"\",'2.RiskAssessment'!Y42)","v":""}]
[null,null,null,{"$f":"IF('2.RiskAssessment'!D414,\"\",'2.RiskAssessment'!D43)","v":" "},null,null,null,null,null,null,null,null,{"$f":"IF('2.RiskAssessment'!M43=0,\"\",'2.RiskAssessment'!M43)","v":""},null,null,null,{"$f":"IF('2.RiskAssessment'!Q43=0,\"\",'2.RiskAssessment'!Q43)","v":""},null,null,null,{"$f":"IF('2.RiskAssessment'!U43=0,\"\",'2.RiskAssessment'!U43)","v":""},null,null,null,{"$f":"IF('2.RiskAssessment'!Y43=0,\"\",'2.RiskAssessment'!Y43)","v":""}]
[null,null,null,{"$f":"IF('2.RiskAssessment'!D415,\"\",'2.RiskAssessment'!D44)","v":" "},null,null,null,null,null,null,null,null,{"$f":"IF('2.RiskAssessment'!M44=0,\"\",'2.RiskAssessment'!M44)","v":""},null,null,null,{"$f":"IF('2.RiskAssessment'!Q44=0,\"\",'2.RiskAssessment'!Q44)","v":""},null,null,null,{"$f":"IF('2.RiskAssessment'!U44=0,\"\",'2.RiskAssessment'!U44)","v":""},null,null,null,{"$f":"IF('2.RiskAssessment'!Y44=0,\"\",'2.RiskAssessment'!Y44)","v":""}]
[null,null,null,{"$f":"IF('2.RiskAssessment'!D416,\"\",'2.RiskAssessment'!D45)","v":" "},null,null,null,null,null,null,null,null,{"$f":"IF('2.RiskAssessment'!M45=0,\"\",'2.RiskAssessment'!M45)","v":""},null,null,null,{"$f":"IF('2.RiskAssessment'!Q45=0,\"\",'2.RiskAssessment'!Q45)","v":""},null,null,null,{"$f":"IF('2.RiskAssessment'!U45=0,\"\",'2.RiskAssessment'!U45)","v":""},null,null,null,{"$f":"IF('2.RiskAssessment'!Y45=0,\"\",'2.RiskAssessment'!Y45)","v":""}]
[null,null,null,{"$f":"IF('2.RiskAssessment'!D417,\"\",'2.RiskAssessment'!D46)","v":" "},null,null,null,null,null,null,null,null,{"$f":"IF('2.RiskAssessment'!M46=0,\"\",'2.RiskAssessment'!M46)","v":""},null,null,null,{"$f":"IF('2.RiskAssessment'!Q46=0,\"\",'2.RiskAssessment'!Q46)","v":""},null,null,null,{"$f":"IF('2.RiskAssessment'!U46=0,\"\",'2.RiskAssessment'!U46)","v":""},null,null,null,{"$f":"IF('2.RiskAssessment'!Y46=0,\"\",'2.RiskAssessment'!Y46)","v":""}]
[null,null,null,{"$f":"IF('2.RiskAssessment'!D418,\"\",'2.RiskAssessment'!D47)","v":" "},null,null,null,null,null,null,null,null,{"$f":"IF('2.RiskAssessment'!M47=0,\"\",'2.RiskAssessment'!M47)","v":""},null,null,null,{"$f":"IF('2.RiskAssessment'!Q47=0,\"\",'2.RiskAssessment'!Q47)","v":""},null,null,null,{"$f":"IF('2.RiskAssessment'!U47=0,\"\",'2.RiskAssessment'!U47)","v":""},null,null,null,{"$f":"IF('2.RiskAssessment'!Y47=0,\"\",'2.RiskAssessment'!Y47)","v":""}]
[null,null,null,{"$f":"IF('2.RiskAssessment'!D419,\"\",'2.RiskAssessment'!D48)","v":" "},null,null,null,null,null,null,null,null,{"$f":"IF('2.RiskAssessment'!M48=0,\"\",'2.RiskAssessment'!M48)","v":""},null,null,null,{"$f":"IF('2.RiskAssessment'!Q48=0,\"\",'2.RiskAssessment'!Q48)","v":""},null,null,null,{"$f":"IF('2.RiskAssessment'!U48=0,\"\",'2.RiskAssessment'!U48)","v":""},null,null,null,{"$f":"IF('2.RiskAssessment'!Y48=0,\"\",'2.RiskAssessment'!Y48)","v":""}]
[null,null,null,{"$f":"IF('2.RiskAssessment'!D420,\"\",'2.RiskAssessment'!D49)","v":" "},null,null,null,null,null,null,null,null,{"$f":"IF('2.RiskAssessment'!M49=0,\"\",'2.RiskAssessment'!M49)","v":""},null,null,null,{"$f":"IF('2.RiskAssessment'!Q49=0,\"\",'2.RiskAssessment'!Q49)","v":""},null,null,null,{"$f":"IF('2.RiskAssessment'!U49=0,\"\",'2.RiskAssessment'!U49)","v":""},null,null,null,{"$f":"IF('2.RiskAssessment'!Y49=0,\"\",'2.RiskAssessment'!Y49)","v":""}]
[null,null,null,{"$f":"IF('2.RiskAssessment'!D421,\"\",'2.RiskAssessment'!D50)","v":" "},null,null,null,null,null,null,null,null,{"$f":"IF('2.RiskAssessment'!M50=0,\"\",'2.RiskAssessment'!M50)","v":""},null,null,null,{"$f":"IF('2.RiskAssessment'!Q50=0,\"\",'2.RiskAssessment'!Q50)","v":""},null,null,null,{"$f":"IF('2.RiskAssessment'!U50=0,\"\",'2.RiskAssessment'!U50)","v":""},null,null,null,{"$f":"IF('2.RiskAssessment'!Y50=0,\"\",'2.RiskAssessment'!Y50)","v":""}]
[null,null,null,{"$f":"IF('2.RiskAssessment'!D422,\"\",'2.RiskAssessment'!D51)","v":" "},null,null,null,null,null,null,null,null,{"$f":"IF('2.RiskAssessment'!M51=0,\"\",'2.RiskAssessment'!M51)","v":""},null,null,null,{"$f":"IF('2.RiskAssessment'!Q51=0,\"\",'2.RiskAssessment'!Q51)","v":""},null,null,null,{"$f":"IF('2.RiskAssessment'!U51=0,\"\",'2.RiskAssessment'!U51)","v":""},null,null,null,{"$f":"IF('2.RiskAssessment'!Y51=0,\"\",'2.RiskAssessment'!Y51)","v":""}]
[null,null,null,{"$f":"IF('2.RiskAssessment'!D423,\"\",'2.RiskAssessment'!D52)","v":" "},null,null,null,null,null,null,null,null,{"$f":"IF('2.RiskAssessment'!M52=0,\"\",'2.RiskAssessment'!M52)","v":""},null,null,null,{"$f":"IF('2.RiskAssessment'!Q52=0,\"\",'2.RiskAssessment'!Q52)","v":""},null,null,null,{"$f":"IF('2.RiskAssessment'!U52=0,\"\",'2.RiskAssessment'!U52)","v":""},null,null,null,{"$f":"IF('2.RiskAssessment'!Y52=0,\"\",'2.RiskAssessment'!Y52)","v":""}]
[null,null,null,{"$f":"IF('2.RiskAssessment'!D424,\"\",'2.RiskAssessment'!D53)","v":" "},null,null,null,null,null,null,null,null,{"$f":"IF('2.RiskAssessment'!M53=0,\"\",'2.RiskAssessment'!M53)","v":""},null,null,null,{"$f":"IF('2.RiskAssessment'!Q53=0,\"\",'2.RiskAssessment'!Q53)","v":""},null,null,null,{"$f":"IF('2.RiskAssessment'!U53=0,\"\",'2.RiskAssessment'!U53)","v":""},null,null,null,{"$f":"IF('2.RiskAssessment'!Y53=0,\"\",'2.RiskAssessment'!Y53)","v":""}]
[null,null,null,{"$f":"IF('2.RiskAssessment'!D425,\"\",'2.RiskAssessment'!D54)","v":" "},null,null,null,null,null,null,null,null,{"$f":"IF('2.RiskAssessment'!M54=0,\"\",'2.RiskAssessment'!M54)","v":""},null,null,null,{"$f":"IF('2.RiskAssessment'!Q54=0,\"\",'2.RiskAssessment'!Q54)","v":""},null,null,null,{"$f":"IF('2.RiskAssessment'!U54=0,\"\",'2.RiskAssessment'!U54)","v":""},null,null,null,{"$f":"IF('2.RiskAssessment'!Y54=0,\"\",'2.RiskAssessment'!Y54)","v":""}]
[null,null,null,{"$f":"IF('2.RiskAssessment'!D426,\"\",'2.RiskAssessment'!D55)","v":" "},null,null,null,null,null,null,null,null,{"$f":"IF('2.RiskAssessment'!M55=0,\"\",'2.RiskAssessment'!M55)","v":""},null,null,null,{"$f":"IF('2.RiskAssessment'!Q55=0,\"\",'2.RiskAssessment'!Q55)","v":""},null,null,null,{"$f":"IF('2.RiskAssessment'!U55=0,\"\",'2.RiskAssessment'!U55)","v":""},null,null,null,{"$f":"IF('2.RiskAssessment'!Y55=0,\"\",'2.RiskAssessment'!Y55)","v":""}]
[null,null,null,{"$f":"IF('2.RiskAssessment'!D427,\"\",'2.RiskAssessment'!D56)","v":" "},null,null,null,null,null,null,null,null,{"$f":"IF('2.RiskAssessment'!M56=0,\"\",'2.RiskAssessment'!M56)","v":""},null,null,null,{"$f":"IF('2.RiskAssessment'!Q56=0,\"\",'2.RiskAssessment'!Q56)","v":""},null,null,null,{"$f":"IF('2.RiskAssessment'!U56=0,\"\",'2.RiskAssessment'!U56)","v":""},null,null,null,{"$f":"IF('2.RiskAssessment'!Y56=0,\"\",'2.RiskAssessment'!Y56)","v":""}]
[null,null,null,{"$f":"IF('2.RiskAssessment'!D428,\"\",'2.RiskAssessment'!D57)","v":" "},null,null,null,null,null,null,null,null,{"$f":"IF('2.RiskAssessment'!M57=0,\"\",'2.RiskAssessment'!M57)","v":""},null,null,null,{"$f":"IF('2.RiskAssessment'!Q57=0,\"\",'2.RiskAssessment'!Q57)","v":""},null,null,null,{"$f":"IF('2.RiskAssessment'!U57=0,\"\",'2.RiskAssessment'!U57)","v":""},null,null,null,{"$f":"IF('2.RiskAssessment'!Y57=0,\"\",'2.RiskAssessment'!Y57)","v":""}]
[null,null,null,{"$f":"IF('2.RiskAssessment'!D429,\"\",'2.RiskAssessment'!D58)","v":" "},null,null,null,null,null,null,null,null,{"$f":"IF('2.RiskAssessment'!M58=0,\"\",'2.RiskAssessment'!M58)","v":""},null,null,null,{"$f":"IF('2.RiskAssessment'!Q58=0,\"\",'2.RiskAssessment'!Q58)","v":""},null,null,null,{"$f":"IF('2.RiskAssessment'!U58=0,\"\",'2.RiskAssessment'!U58)","v":""},null,null,null,{"$f":"IF('2.RiskAssessment'!Y58=0,\"\",'2.RiskAssessment'!Y58)","v":""}]
[null,null,null,{"$f":"IF('2.RiskAssessment'!D430,\"\",'2.RiskAssessment'!D59)","v":" "},null,null,null,null,null,null,null,null,{"$f":"IF('2.RiskAssessment'!M59=0,\"\",'2.RiskAssessment'!M59)","v":""},null,null,null,{"$f":"IF('2.RiskAssessment'!Q59=0,\"\",'2.RiskAssessment'!Q59)","v":""},null,null,null,{"$f":"IF('2.RiskAssessment'!U59=0,\"\",'2.RiskAssessment'!U59)","v":""},null,null,null,{"$f":"IF('2.RiskAssessment'!Y59=0,\"\",'2.RiskAssessment'!Y59)","v":""}]
[null,null,null,{"$f":"IF('2.RiskAssessment'!D431,\"\",'2.RiskAssessment'!D60)","v":" "},null,null,null,null,null,null,null,null,{"$f":"IF('2.RiskAssessment'!M60=0,\"\",'2.RiskAssessment'!M60)","v":""},null,null,null,{"$f":"IF('2.RiskAssessment'!Q60=0,\"\",'2.RiskAssessment'!Q60)","v":""},null,null,null,{"$f":"IF('2.RiskAssessment'!U60=0,\"\",'2.RiskAssessment'!U60)","v":""},null,null,null,{"$f":"IF('2.RiskAssessment'!Y60=0,\"\",'2.RiskAssessment'!Y60)","v":""}]
[null,null,null,{"$f":"IF('2.RiskAssessment'!D432,\"\",'2.RiskAssessment'!D61)","v":" "},null,null,null,null,null,null,null,null,{"$f":"IF('2.RiskAssessment'!M61=0,\"\",'2.RiskAssessment'!M61)","v":""},null,null,null,{"$f":"IF('2.RiskAssessment'!Q61=0,\"\",'2.RiskAssessment'!Q61)","v":""},null,null,null,{"$f":"IF('2.RiskAssessment'!U61=0,\"\",'2.RiskAssessment'!U61)","v":""},null,null,null,{"$f":"IF('2.RiskAssessment'!Y61=0,\"\",'2.RiskAssessment'!Y61)","v":""}]
[null,null,null,{"$f":"IF('2.RiskAssessment'!D433,\"\",'2.RiskAssessment'!D62)","v":" "},null,null,null,null,null,null,null,null,{"$f":"IF('2.RiskAssessment'!M62=0,\"\",'2.RiskAssessment'!M62)","v":""},null,null,null,{"$f":"IF('2.RiskAssessment'!Q62=0,\"\",'2.RiskAssessment'!Q62)","v":""},null,null,null,{"$f":"IF('2.RiskAssessment'!U62=0,\"\",'2.RiskAssessment'!U62)","v":""},null,null,null,{"$f":"IF('2.RiskAssessment'!Y62=0,\"\",'2.RiskAssessment'!Y62)","v":""}]
[null,null,null,{"$f":"IF('2.RiskAssessment'!D434,\"\",'2.RiskAssessment'!D63)","v":" "},null,null,null,null,null,null,null,null,{"$f":"IF('2.RiskAssessment'!M63=0,\"\",'2.RiskAssessment'!M63)","v":""},null,null,null,{"$f":"IF('2.RiskAssessment'!Q63=0,\"\",'2.RiskAssessment'!Q63)","v":""},null,null,null,{"$f":"IF('2.RiskAssessment'!U63=0,\"\",'2.RiskAssessment'!U63)","v":""},null,null,null,{"$f":"IF('2.RiskAssessment'!Y63=0,\"\",'2.RiskAssessment'!Y63)","v":""}]
[null,null,null,{"$f":"IF('2.RiskAssessment'!D435,\"\",'2.RiskAssessment'!D64)","v":" "},null,null,null,null,null,null,null,null,{"$f":"IF('2.RiskAssessment'!M64=0,\"\",'2.RiskAssessment'!M64)","v":""},null,null,null,{"$f":"IF('2.RiskAssessment'!Q64=0,\"\",'2.RiskAssessment'!Q64)","v":""},null,null,null,{"$f":"IF('2.RiskAssessment'!U64=0,\"\",'2.RiskAssessment'!U64)","v":""},null,null,null,{"$f":"IF('2.RiskAssessment'!Y64=0,\"\",'2.RiskAssessment'!Y64)","v":""}]
[null,null,null,{"$f":"IF('2.RiskAssessment'!D436,\"\",'2.RiskAssessment'!D65)","v":" "},null,null,null,null,null,null,null,null,{"$f":"IF('2.RiskAssessment'!M65=0,\"\",'2.RiskAssessment'!M65)","v":""},null,null,null,{"$f":"IF('2.RiskAssessment'!Q65=0,\"\",'2.RiskAssessment'!Q65)","v":""},null,null,null,{"$f":"IF('2.RiskAssessment'!U65=0,\"\",'2.RiskAssessment'!U65)","v":""},null,null,null,{"$f":"IF('2.RiskAssessment'!Y65=0,\"\",'2.RiskAssessment'!Y65)","v":""}]
[null,null,null,{"$f":"IF('2.RiskAssessment'!D437,\"\",'2.RiskAssessment'!D66)","v":" "},null,null,null,null,null,null,null,null,{"$f":"IF('2.RiskAssessment'!M66=0,\"\",'2.RiskAssessment'!M66)","v":""},null,null,null,{"$f":"IF('2.RiskAssessment'!Q66=0,\"\",'2.RiskAssessment'!Q66)","v":""},null,null,null,{"$f":"IF('2.RiskAssessment'!U66=0,\"\",'2.RiskAssessment'!U66)","v":""},null,null,null,{"$f":"IF('2.RiskAssessment'!Y66=0,\"\",'2.RiskAssessment'!Y66)","v":""}]
[null,null,null,{"$f":"IF('2.RiskAssessment'!D438,\"\",'2.RiskAssessment'!D67)","v":" "},null,null,null,null,null,null,null,null,{"$f":"IF('2.RiskAssessment'!M67=0,\"\",'2.RiskAssessment'!M67)","v":""},null,null,null,{"$f":"IF('2.RiskAssessment'!Q67=0,\"\",'2.RiskAssessment'!Q67)","v":""},null,null,null,{"$f":"IF('2.RiskAssessment'!U67=0,\"\",'2.RiskAssessment'!U67)","v":""},null,null,null,{"$f":"IF('2.RiskAssessment'!Y67=0,\"\",'2.RiskAssessment'!Y67)","v":""}]
[null,null,null,{"$f":"IF('2.RiskAssessment'!D439,\"\",'2.RiskAssessment'!D68)","v":" "},null,null,null,null,null,null,null,null,{"$f":"IF('2.RiskAssessment'!M68=0,\"\",'2.RiskAssessment'!M68)","v":""},null,null,null,{"$f":"IF('2.RiskAssessment'!Q68=0,\"\",'2.RiskAssessment'!Q68)","v":""},null,null,null,{"$f":"IF('2.RiskAssessment'!U68=0,\"\",'2.RiskAssessment'!U68)","v":""},null,null,null,{"$f":"IF('2.RiskAssessment'!Y68=0,\"\",'2.RiskAssessment'!Y68)","v":""}]
[null,null,null,{"$f":"IF('2.RiskAssessment'!D440,\"\",'2.RiskAssessment'!D69)","v":" "},null,null,null,null,null,null,null,null,{"$f":"IF('2.RiskAssessment'!M69=0,\"\",'2.RiskAssessment'!M69)","v":""},null,null,null,{"$f":"IF('2.RiskAssessment'!Q69=0,\"\",'2.RiskAssessment'!Q69)","v":""},null,null,null,{"$f":"IF('2.RiskAssessment'!U69=0,\"\",'2.RiskAssessment'!U69)","v":""},null,null,null,{"$f":"IF('2.RiskAssessment'!Y69=0,\"\",'2.RiskAssessment'!Y69)","v":""}]
[null,null,null,{"$f":"IF('2.RiskAssessment'!D441,\"\",'2.RiskAssessment'!D70)","v":" "},null,null,null,null,null,null,null,null,{"$f":"IF('2.RiskAssessment'!M70=0,\"\",'2.RiskAssessment'!M70)","v":""},null,null,null,{"$f":"IF('2.RiskAssessment'!Q70=0,\"\",'2.RiskAssessment'!Q70)","v":""},null,null,null,{"$f":"IF('2.RiskAssessment'!U70=0,\"\",'2.RiskAssessment'!U70)","v":""},null,null,null,{"$f":"IF('2.RiskAssessment'!Y70=0,\"\",'2.RiskAssessment'!Y70)","v":""}]
[]
[]
[null,null,{"$f":"IFERROR(      IF(INDEX(L_GuidelineStatus,MATCH(NACE,L_NACE,0))=\"Drafted\",2,\"\"),      \"\")","v":""},{"$f":"IFERROR(      IF(INDEX(L_GuidelineStatus,MATCH(NACE,L_NACE,0))=\"Drafted\",\n\"For more information on the key E&S issues present in this sector, please consult the relevant chapter in EBRD's Subsectoral\",\n\"\"),      \"\")","v":""}]
[null,null,null,{"$f":"IFERROR(      IF(INDEX(L_GuidelineStatus,MATCH(NACE,L_NACE,0))=\"Drafted\",\n\"environmental and social guidelines:\",\n\"\"),      \"\")","v":""},null,null,null,null,null,null,{"$f":"IFERROR(      IF(INDEX(L_GuidelineStatus,MATCH(NACE,L_NACE,0))=\"Drafted\",\n\"http://www.ebrd.com/environment/e-manual/af6guide.html\",\n\"\"),      \"\")","v":""}]
[]
[]
[null,"3. Legal Compliance Check"]
[]
[null,null,"(i) Regulatory Compliance"]
[]
[null,null,"Key Considerations",null,null,null,null,null,null,null,null,null,null,null,null,null,null,null,null,"Y/N",null,"Comments"]
[null,null,"Has your client confirmed in writing that they are in compliance with all environmental and social legislation applicable to their business/operations? ",null,null,null,null,null,null,null,null,null,null,null,null,null,null,null,null,{"$f":"IF('3.LegalCompliance'!T9=0,\"\",'3.LegalCompliance'!T9)","v":""},null,{"$f":"IF('3.LegalCompliance'!V9=0,\"\",'3.LegalCompliance'!V9)","v":""}]
[null,null,"Despite receiving written confirmation, are you nevertheless concerned that your client is not in compliance with all environmental and social legislation applicable to their business/operations? ",null,null,null,null,null,null,null,null,null,null,null,null,null,null,null,null,{"$f":"IF('3.LegalCompliance'!T10=0,\"\",'3.LegalCompliance'!T10)","v":""}]
[null,null,"If you remain concerned, have you checked compliance through the review of permits/licences or through direct contact with the local regulator? ",null,null,null,null,null,null,null,null,null,null,null,null,null,null,null,null,{"$f":"IF('3.LegalCompliance'!T11=0,\"\",'3.LegalCompliance'!T11)","v":""}]
[]
[null,null,"(ii) Contaminated Land Issues"]
[]
[null,null,"Applicability",null,null,null,null,null,null,null,null,null,null,null,null,null,null,null,null,"Y/N",null,"Comments"]
[null,null,"Are land/buildings to be taken as security/collateral for the loan?",null,null,null,null,null,null,null,null,null,null,null,null,null,null,null,null,{"$f":"IF('3.LegalCompliance'!T16=0,\"\",'3.LegalCompliance'!T16)","v":""},null,{"$f":"IF('3.LegalCompliance'!V16=0,\"\",'3.LegalCompliance'!V16)","v":""}]
[]
[null,null,"Key Considerations",null,null,null,null,null,null,null,null,null,null,null,null,null,null,null,null,"Y/N",null,"Comments"]
[null,null,"Is there any past and present known contamination to soils or groundwater associated with the site, either through company activities or contamination flowing from neighbouring sites?",null,null,null,null,null,null,null,null,null,null,null,null,null,null,null,null,{"$f":"IF('3.LegalCompliance'!T19=0,\"\",'3.LegalCompliance'!T19)","v":""},null,{"$f":"IF('3.LegalCompliance'!V19=0,\"\",'3.LegalCompliance'!V19)","v":""}]
[null,null,"Is the site free from evidence of leaks or spills around storage tanks/areas and process equipment?",null,null,null,null,null,null,null,null,null,null,null,null,null,null,null,null,{"$f":"IF('3.LegalCompliance'!T20=0,\"\",'3.LegalCompliance'!T20)","v":""}]
[null,null,"Is there adequate protection, such as secondary containment, around storage tanks?",null,null,null,null,null,null,null,null,null,null,null,null,null,null,null,null,{"$f":"IF('3.LegalCompliance'!T21=0,\"\",'3.LegalCompliance'!T21)","v":""}]
[null,null,"Are underground installations such as storage tanks and sewer systems, where present, inspected regularly?",null,null,null,null,null,null,null,null,null,null,null,null,null,null,null,null,{"$f":"IF('3.LegalCompliance'!T22=0,\"\",'3.LegalCompliance'!T22)","v":""}]
[null,null,"Are any specialist reports available examining the site’s geology and history from a potential contamination viewpoint?",null,null,null,null,null,null,null,null,null,null,null,null,null,null,null,null,{"$f":"IF('3.LegalCompliance'!T23=0,\"\",'3.LegalCompliance'!T23)","v":""}]
[]
[]
[null,"4. Commitment, Capacity and Track Record Questionnaire"]
[]
[]
[]
[null,null,null,null,null,null,"Commitment",null,null,null,null,null,"Capacity",null,null,null,null,null,"Track Record"]
[]
[null,null,null,null,null,null,{"$f":"'4.CC&TR'!H7","v":0},null,null,null,null,null,{"$f":"'4.CC&TR'!N7","v":0},null,null,null,null,null,{"$f":"'4.CC&TR'!T7","v":0}]
[]
[]
[]
[null,null,"Summary Chart"]
[]
[]
[]
[]
[]
[]
[]
[]
[]
[]
[]
[]
[]
[]
[]
[]
[]
[]
[]
[]
[]
[null,null,"(i) Commitment"]
[]
[null,null,"What Environmental and Social (E&S) Policy commitments does the client have in place?",null,null,null,null,null,null,null,null,null,null,null,null,null,null,null,null,null,null,null,null,null,null,"Y/N"]
[null,null,"Best \nPractice",null,null,"Leading E&S Policy: The client's policy states in detail its commitment to: (a) comply with industry best practice guidelines and national legislation; (b) the principle of continuous improvement; (c) address all key E&S risks resulting from, or relevant to, its activities; (d) apply E&S policy requirements to Third Parties; and (e) actively engage with and disclose all relevant E&S information to its stakeholders.",null,null,null,null,null,null,null,null,null,null,null,null,null,null,null,null,null,null,null,{"$f":"IF('4'!$D$8=1,\"Yes\",\"-\")","v":"-"},{"$f":"IF('4'!$D$8=0,0,IF('4'!$D$8<>1,1,0))","v":0}]
[null,null,"Good \nPractice",null,null,"Standard E&S Policy: The client's policy states its commitment to: (a) comply with standard industry approaches and national legislation; (b) the principle of continuous improvement (c) address all key E&S risks resulting from, or relevant to, its activities; and (d) engage and disclose all relevant E&S information to its stakeholders.",null,null,null,null,null,null,null,null,null,null,null,null,null,null,null,null,null,null,null,{"$f":"IF('4'!$D$8=2,\"Yes\",\"-\")","v":"-"},{"$f":"IF('4'!$D$8=0,0,IF('4'!$D$8<>2,1,0))","v":0}]
[null,null,"Satisfactory",null,null,"Incomplete E&S Policy: The client's policy provides only a high level statement of its commitment to E&S standards and to addressing the key E&S risks resulting from, or relevant to, its activities. The policy provides limited or no information with regard to information disclosure and engagement of stakeholders.",null,null,null,null,null,null,null,null,null,null,null,null,null,null,null,null,null,null,null,{"$f":"IF('4'!$D$8=3,\"Yes\",\"-\")","v":"-"},{"$f":"IF('4'!$D$8=0,0,IF('4'!$D$8<>3,1,0))","v":0}]
[null,null,"Deficient",null,null,"No E&S Policy: The client does not have an E&S policy or has not made its E&S policy available.",null,null,null,null,null,null,null,null,null,null,null,null,null,null,null,null,null,null,null,{"$f":"IF('4'!$D$8=4,\"Yes\",\"-\")","v":"-"},{"$f":"IF('4'!$D$8=0,0,IF('4'!$D$8<>4,1,0))","v":0}]
[]
[null,null,"What is the commitment level of Senior Management to Environmental and Social (E&S) Issues?",null,null,null,null,null,null,null,null,null,null,null,null,null,null,null,null,null,null,null,null,null,null,"Y/N"]
[null,null,"Best \nPractice",null,null,"High Level of Senior Management Commitment: Senior Management: (a) has oversight and/or responsibility for the application of E&S policies and E&S risk management; (b) always considers E&S issues when making business decisions; and (c) remuneration is aligned to performance in the management of E&S issues. ",null,null,null,null,null,null,null,null,null,null,null,null,null,null,null,null,null,null,null,{"$f":"IF('4'!$D$9=1,\"Yes\",\"-\")","v":"-"},{"$f":"IF('4'!$D$9=0,0,IF('4'!$D$9<>1,1,0))","v":0}]
[null,null,"Good \nPractice",null,null,"Standard Level of Senior Management Commitment: Middle Management mostly has oversight and/or responsibility for the application of E&S policies and E&S management system; E&S issues are sometimes considered by Senior Management when making business decisions. ",null,null,null,null,null,null,null,null,null,null,null,null,null,null,null,null,null,null,null,{"$f":"IF('4'!$D$9=2,\"Yes\",\"-\")","v":"-"},{"$f":"IF('4'!$D$9=0,0,IF('4'!$D$9<>2,1,0))","v":0}]
[null,null,"Satisfactory",null,null,"Limited Level of Senior Management Commitment: Middle Management has responsibility for E&S issues; E&S issues are seldom considered by Senior Management when making business decisions.",null,null,null,null,null,null,null,null,null,null,null,null,null,null,null,null,null,null,null,{"$f":"IF('4'!$D$9=3,\"Yes\",\"-\")","v":"-"},{"$f":"IF('4'!$D$9=0,0,IF('4'!$D$9<>3,1,0))","v":0}]
[null,null,"Deficient",null,null,"No Senior Management Commitment: There is no Senior Management responsibility for E&S issues; E&S issues are never considered by Senior Management when making business decisions.",null,null,null,null,null,null,null,null,null,null,null,null,null,null,null,null,null,null,null,{"$f":"IF('4'!$D$9=4,\"Yes\",\"-\")","v":"-"},{"$f":"IF('4'!$D$9=0,0,IF('4'!$D$9<>4,1,0))","v":0}]
[]
[null,null,"How does the client engage with stakeholders on Environmental and Social (E&S) Issues?",null,null,null,null,null,null,null,null,null,null,null,null,null,null,null,null,null,null,null,null,null,null,"Y/N"]
[null,null,"Best \nPractice",null,null,"Integrated Stakeholder Engagement: In addition to the implementation of a Formal Stakeholder Engagement Programme, the client demonstrates the active integration of stakeholder feedback and needs into E&S policy frameworks and management systems that influence business decision making.",null,null,null,null,null,null,null,null,null,null,null,null,null,null,null,null,null,null,null,{"$f":"IF('4'!$D$10=1,\"Yes\",\"-\")","v":"-"},{"$f":"IF('4'!$D$10=0,0,IF('4'!$D$10<>1,1,0))","v":0}]
[null,null,"Good \nPractice",null,null,"Formalised Stakeholder Engagement: A Formal Stakeholder Engagement Programme has been implemented and the client engages in regular dialogue on E&S issues with all key stakeholders.",null,null,null,null,null,null,null,null,null,null,null,null,null,null,null,null,null,null,null,{"$f":"IF('4'!$D$10=2,\"Yes\",\"-\")","v":"-"},{"$f":"IF('4'!$D$10=0,0,IF('4'!$D$10<>2,1,0))","v":0}]
[null,null,"Satisfactory",null,null,"Reactive Stakeholder Engagement: There is no Formal Stakeholder Engagement Programme, and the client engages with stakeholders on an ad hoc and reactive basis (typically only in the event of a crisis), and on a limited range of issues which often do not include E&S issues.",null,null,null,null,null,null,null,null,null,null,null,null,null,null,null,null,null,null,null,{"$f":"IF('4'!$D$10=3,\"Yes\",\"-\")","v":"-"},{"$f":"IF('4'!$D$10=0,0,IF('4'!$D$10<>3,1,0))","v":0}]
[null,null,"Deficient",null,null,"No Stakeholder Engagement: The client does not engage with stakeholders on E&S issues.",null,null,null,null,null,null,null,null,null,null,null,null,null,null,null,null,null,null,null,{"$f":"IF('4'!$D$10=4,\"Yes\",\"-\")","v":"-"},{"$f":"IF('4'!$D$10=0,0,IF('4'!$D$10<>4,1,0))","v":0}]
[]
[null,null,"What is the level of commitment to the Environmental and Social (E&S) Performance of Third Parties (e.g. a client, supplier and/or principal contractor which has an active and substantial role which is material to business operations)?",null,null,null,null,null,null,null,null,null,null,null,null,null,null,null,null,null,null,null,null,null,null,"Y/N"]
[null,null,"Best \nPractice",null,null,"High Level of Commitment to Third Party E&S Performance: Where third parties have an active role which is material to business operations, the client requires Third Parties to apply the same E&S policy and  performance requirements that it applies to itself, provides training and support to Third Parties on E&S performance, and periodically audits their E&S performance.",null,null,null,null,null,null,null,null,null,null,null,null,null,null,null,null,null,null,null,{"$f":"IF('4'!$D$11=1,\"Yes\",\"-\")","v":"-"},{"$f":"IF('4'!$D$11=0,0,IF('4'!$D$11<>1,1,0))","v":0}]
[null,null,"Good \nPractice",null,null,"Adequate Level of Commitment to Third Party E&S Performance: Where Third Parties have an active role which is material to business operations, the client requires Third Parties to apply the same E&S policy and performance requirements that it applies to itself.",null,null,null,null,null,null,null,null,null,null,null,null,null,null,null,null,null,null,null,{"$f":"IF('4'!$D$11=2,\"Yes\",\"-\")","v":"-"},{"$f":"IF('4'!$D$11=0,0,IF('4'!$D$11<>2,1,0))","v":0}]
[null,null,"Satisfactory",null,null,"Limited Level of Commitment to Third Party E&S Performance: Where Third Parties have an active role which is material to business operations, the client only has limited Third Party E&S policy and performance requirements (i.e. E&S requirements may be lower than what the client applies to itself or performance requirements cover limited E&S risk).",null,null,null,null,null,null,null,null,null,null,null,null,null,null,null,null,null,null,null,{"$f":"IF('4'!$D$11=3,\"Yes\",\"-\")","v":"-"},{"$f":"IF('4'!$D$11=0,0,IF('4'!$D$11<>3,1,0))","v":0}]
[null,null,"Deficient",null,null,"No Commitment to Third Party E&S Performance: Where Third Parties have an active role which is material to business operations, the client does not have any E&S performance requirements for Third Parties.",null,null,null,null,null,null,null,null,null,null,null,null,null,null,null,null,null,null,null,{"$f":"IF('4'!$D$11=4,\"Yes\",\"-\")","v":"-"},{"$f":"IF('4'!$D$11=0,0,IF('4'!$D$11<>4,1,0))","v":0}]
[]
[null,null,"(ii) Capacity"]
[]
[null,null,"How comprehensive is the client's Environmental and Social Management System (ESMS)?",null,null,null,null,null,null,null,null,null,null,null,null,null,null,null,null,null,null,null,null,null,null,"Y/N"]
[null,null,"Best \nPractice",null,null,"Comprehensive ESMS: The client has a Standard ESMS which is: (a) fully and systematically integrated into broader company management; (b) certified (>70% of total operations) to at least one internationally recognised standard (e.g. ISO 14001, OHSAS 18001, SA 8000); and (c) independently verified.",null,null,null,null,null,null,null,null,null,null,null,null,null,null,null,null,null,null,null,{"$f":"IF('4'!$D$13=1,\"Yes\",\"-\")","v":"-"},{"$f":"IF('4'!$D$13=0,0,IF('4'!$D$13<>1,1,0))","v":0}]
[null,null,"Good \nPractice",null,null,"Standard ESMS: The client has a Standard ESMS which is capable of being certified to an international standard (e.g. ISO 14001), sets targets for material impacts and reports on progress, and the effectiveness of which is internally audited on a regular periodic basis.",null,null,null,null,null,null,null,null,null,null,null,null,null,null,null,null,null,null,null,{"$f":"IF('4'!$D$13=2,\"Yes\",\"-\")","v":"-"},{"$f":"IF('4'!$D$13=0,0,IF('4'!$D$13<>2,1,0))","v":0}]
[null,null,"Satisfactory",null,null,"Partial ESMS: The client's ESMS is characterised by: (a) partial coverage of key E&S risks; (b) limited commitment to specific targets; and (c) limited disclosure of information. ",null,null,null,null,null,null,null,null,null,null,null,null,null,null,null,null,null,null,null,{"$f":"IF('4'!$D$13=3,\"Yes\",\"-\")","v":"-"},{"$f":"IF('4'!$D$13=0,0,IF('4'!$D$13<>3,1,0))","v":0}]
[null,null,"Deficient",null,null,"Deficient or Absent ESMS: The client does not have an ESMS or, if one exists, it is characterised by little or no detail relating to: (a) coverage of E&S risks; (b) specific focus or targets; and (c) disclosure of information.",null,null,null,null,null,null,null,null,null,null,null,null,null,null,null,null,null,null,null,{"$f":"IF('4'!$D$13=4,\"Yes\",\"-\")","v":"-"},{"$f":"IF('4'!$D$13=0,0,IF('4'!$D$13<>4,1,0))","v":0}]
[]
[null,null,"What organisational capacity exists to manage Environmental and Social (E&S) issues?",null,null,null,null,null,null,null,null,null,null,null,null,null,null,null,null,null,null,null,null,null,null,"Y/N"]
[null,null,"Best \nPractice",null,null,"Strong Organisational Capacity to Manage E&S Issues: Appropriately qualified staff with clearly defined and specific E&S responsibilities are embedded across all relevant areas of the client's business, and responsibilities are clearly aligned to the ESMS. All staff with lead responsibility for E&S issue management have this articulated in their job specifications and are incentivised and rewarded appropriately. ",null,null,null,null,null,null,null,null,null,null,null,null,null,null,null,null,null,null,null,{"$f":"IF('4'!$D$14=1,\"Yes\",\"-\")","v":"-"},{"$f":"IF('4'!$D$14=0,0,IF('4'!$D$14<>1,1,0))","v":0}]
[null,null,"Good \nPractice",null,null,"Standard Organisational Capacity to Manage E&S Issues: Appropriately qualified staff are appointed to monitor and oversee E&S issues, with responsibilities clearly aligned to the ESMS.",null,null,null,null,null,null,null,null,null,null,null,null,null,null,null,null,null,null,null,{"$f":"IF('4'!$D$14=2,\"Yes\",\"-\")","v":"-"},{"$f":"IF('4'!$D$14=0,0,IF('4'!$D$14<>2,1,0))","v":0}]
[null,null,"Satisfactory",null,null,"Limited Organisational Capacity to Manage E&S Issues: Day-to-day E&S responsibilities are unclear, with uncertain capacity across breadth of operations and/or evidence of partial qualifications or competencies to deal with E&S issues. Limited evidence to show E&S responsibilities are aligned to the ESMS.",null,null,null,null,null,null,null,null,null,null,null,null,null,null,null,null,null,null,null,{"$f":"IF('4'!$D$14=3,\"Yes\",\"-\")","v":"-"},{"$f":"IF('4'!$D$14=0,0,IF('4'!$D$14<>3,1,0))","v":0}]
[null,null,"Deficient",null,null,"Insufficient Organisational Capacity to Manage E&S Issues: No specific capacity or accountability for E&S issues, with no staff responsibility for the ESMS.",null,null,null,null,null,null,null,null,null,null,null,null,null,null,null,null,null,null,null,{"$f":"IF('4'!$D$14=4,\"Yes\",\"-\")","v":"-"},{"$f":"IF('4'!$D$14=0,0,IF('4'!$D$14<>4,1,0))","v":0}]
[]
[null,null,"Are staff appropriately trained on relevant Environmental and Social (E&S) issues?",null,null,null,null,null,null,null,null,null,null,null,null,null,null,null,null,null,null,null,null,null,null,"Y/N"]
[null,null,"Best \nPractice",null,null,"High Level of E&S Training: Employees and Third Parties receive appropriate and comprehensive E&S training, which also covers the organisation's ESMS. Mandatory E&S training on certain modules (e.g. Occupational Health and Safety (OH&S)) is required for all staff on an ongoing basis to ensure knowledge is up-to-date, as well as mandatory E&S induction training for new joiners.",null,null,null,null,null,null,null,null,null,null,null,null,null,null,null,null,null,null,null,{"$f":"IF('4'!$D$15=1,\"Yes\",\"-\")","v":"-"},{"$f":"IF('4'!$D$15=0,0,IF('4'!$D$15<>1,1,0))","v":0}]
[null,null,"Good \nPractice",null,null,"Adequate Level of E&S Training: Employees receive adequate training which covers the organisation's ESMS and E&S issues relevant to their roles (including OH&S and emergency planning/preparedness).",null,null,null,null,null,null,null,null,null,null,null,null,null,null,null,null,null,null,null,{"$f":"IF('4'!$D$15=2,\"Yes\",\"-\")","v":"-"},{"$f":"IF('4'!$D$15=0,0,IF('4'!$D$15<>2,1,0))","v":0}]
[null,null,"Satisfactory",null,null,"Limited Level of E&S Training: Only staff with key E&S responsibilities receive training; training is partial in detail and completeness with limited links to the organisation's ESMS.",null,null,null,null,null,null,null,null,null,null,null,null,null,null,null,null,null,null,null,{"$f":"IF('4'!$D$15=3,\"Yes\",\"-\")","v":"-"},{"$f":"IF('4'!$D$15=0,0,IF('4'!$D$15<>3,1,0))","v":0}]
[null,null,"Deficient",null,null,"No E&S Training: Employees do not receive any E&S training. ",null,null,null,null,null,null,null,null,null,null,null,null,null,null,null,null,null,null,null,{"$f":"IF('4'!$D$15=4,\"Yes\",\"-\")","v":"-"},{"$f":"IF('4'!$D$15=0,0,IF('4'!$D$15<>4,1,0))","v":0}]
[]
[null,null,"How does the client manage the Environmental and Social (E&S) Capacity of Third Parties (e.g. a client, supplier and/or principal contractor which has an active and substantial role which is material to business operations)?",null,null,null,null,null,null,null,null,null,null,null,null,null,null,null,null,null,null,null,null,null,null,"Y/N"]
[null,null,"Best \nPractice",null,null,"Strong Management of E&S Third Party Capacity: The client displays a systematic approach to assessing and managing Third Party E&S capacity  (e.g. conducts site visits to check E&S issue management resourcing and training levels, and regularly reviews and monitors E&S governance structures). The client is part of a broader alliance (e.g. labour unions, communities etc.) to deliver E&S benefits and opportunities. ",null,null,null,null,null,null,null,null,null,null,null,null,null,null,null,null,null,null,null,{"$f":"IF('4'!$D$16=1,\"Yes\",\"-\")","v":"-"},{"$f":"IF('4'!$D$16=0,0,IF('4'!$D$16<>1,1,0))","v":0}]
[null,null,"Good \nPractice",null,null,"Adequate Management of E&S Third Party Capacity: The client displays active assessment and management of the E&S capacity of Third Parties (e.g. through the use of procurement checklists to identify E&S issue management resources).",null,null,null,null,null,null,null,null,null,null,null,null,null,null,null,null,null,null,null,{"$f":"IF('4'!$D$16=2,\"Yes\",\"-\")","v":"-"},{"$f":"IF('4'!$D$16=0,0,IF('4'!$D$16<>2,1,0))","v":0}]
[null,null,"Satisfactory",null,null,"Limited Management of Third Party E&S Capacity: The client has not implemented appropriate systems and procedures to identify and manage Third Party E&S risks. ",null,null,null,null,null,null,null,null,null,null,null,null,null,null,null,null,null,null,null,{"$f":"IF('4'!$D$16=3,\"Yes\",\"-\")","v":"-"},{"$f":"IF('4'!$D$16=0,0,IF('4'!$D$16<>3,1,0))","v":0}]
[null,null,"Deficient",null,null,"No Management of Third Party E&S Capacity: The client does not manage or take responsibility for Third Party E&S risks.",null,null,null,null,null,null,null,null,null,null,null,null,null,null,null,null,null,null,null,{"$f":"IF('4'!$D$16=4,\"Yes\",\"-\")","v":"-"},{"$f":"IF('4'!$D$16=0,0,IF('4'!$D$16<>4,1,0))","v":0}]
[]
[null,null,"(iii) Track Record"]
[]
[null,null,"Does the client demonstrate Good Corporate Citizenship?",null,null,null,null,null,null,null,null,null,null,null,null,null,null,null,null,null,null,null,null,null,null,"Y/N"]
[null,null,"Best \nPractice",null,null,"High Level of Good Corporate Citizenship: The client: (a) is well-regarded by all stakeholder groups; (b) systematically identifies the needs of all stakeholders through active consultation and an effective grievance mechanism (complaints procedure); and (c) actively strives to deliver and monitor local benefits. ",null,null,null,null,null,null,null,null,null,null,null,null,null,null,null,null,null,null,null,{"$f":"IF('4'!$D$18=1,\"Yes\",\"-\")","v":"-"},{"$f":"IF('4'!$D$18=0,0,IF('4'!$D$18<>1,1,0))","v":0}]
[null,null,"Good \nPractice",null,null,"Standard Level of Good Corporate Citizenship: The client: (a) is generally well-regarded by all stakeholder groups; (b) consults with relevant stakeholders; and has in place an effective grievance mechanism (complaints procedure); and (c) delivers local benefits. ",null,null,null,null,null,null,null,null,null,null,null,null,null,null,null,null,null,null,null,{"$f":"IF('4'!$D$18=2,\"Yes\",\"-\")","v":"-"},{"$f":"IF('4'!$D$18=0,0,IF('4'!$D$18<>2,1,0))","v":0}]
[null,null,"Satisfactory",null,null,"Limited Level of Good Corporate Citizenship: There is: (a) evidence of complaints against the client in the past two years and the management response is largely reactive; (b) the needs of stakeholders are addressed in an ad hoc manner and an effective grievance mechanism has not been implemented; and/or (c) the client does not seek to deliver local benefits. ",null,null,null,null,null,null,null,null,null,null,null,null,null,null,null,null,null,null,null,{"$f":"IF('4'!$D$18=3,\"Yes\",\"-\")","v":"-"},{"$f":"IF('4'!$D$18=0,0,IF('4'!$D$18<>3,1,0))","v":0}]
[null,null,"Deficient",null,null,"Poor Level of Good Corporate Citizenship: There is evidence that the client has a poor relationship with many stakeholder groups and has been subject to negative media campaigns and boycotts. The client does not demonstrate any attempt to address E&S issues. The client does not recognise a need to deliver any local benefits. ",null,null,null,null,null,null,null,null,null,null,null,null,null,null,null,null,null,null,null,{"$f":"IF('4'!$D$18=4,\"Yes\",\"-\")","v":"-"},{"$f":"IF('4'!$D$18=0,0,IF('4'!$D$18<>4,1,0))","v":0}]
[]
[null,null,"What is the client's track record with regards to Occupational Health and Safety (OH&S)?",null,null,null,null,null,null,null,null,null,null,null,null,null,null,null,null,null,null,null,null,null,null,"Y/N"]
[null,null,"Best \nPractice",null,null,"Strong OH&S Track Record: Injury and accident rates are low and/or are lower relative to peers and/or show consistent decline over time. Emergency responses to incidents and accidents is rapid, and appropriate lessons are learned and applied effectively. Management have developed improvement plans to reduce the risks of accident for high risk OH&S areas.",null,null,null,null,null,null,null,null,null,null,null,null,null,null,null,null,null,null,null,{"$f":"IF('4'!$D$19=1,\"Yes\",\"-\")","v":"-"},{"$f":"IF('4'!$D$19=0,0,IF('4'!$D$19<>1,1,0))","v":0}]
[null,null,"Good \nPractice",null,null,"Average OH&S Track Record: Injury and accident rates remain stable or are lower than last year. Emergency response planning and capacity is evident.",null,null,null,null,null,null,null,null,null,null,null,null,null,null,null,null,null,null,null,{"$f":"IF('4'!$D$19=2,\"Yes\",\"-\")","v":"-"},{"$f":"IF('4'!$D$19=0,0,IF('4'!$D$19<>2,1,0))","v":0}]
[null,null,"Satisfactory",null,null,"Poor OH&S Track Record: Accident/injury rates are high and/or do not demonstrate a declining trend. Limited emergency response planning or capacity is evident.",null,null,null,null,null,null,null,null,null,null,null,null,null,null,null,null,null,null,null,{"$f":"IF('4'!$D$19=3,\"Yes\",\"-\")","v":"-"},{"$f":"IF('4'!$D$19=0,0,IF('4'!$D$19<>3,1,0))","v":0}]
[null,null,"Deficient",null,null,"Very Poor OH&S Track Record: Accident/injury rates are high and increasing and/or no accident statistics are made available for review. No emergency response capacity is evident. ",null,null,null,null,null,null,null,null,null,null,null,null,null,null,null,null,null,null,null,{"$f":"IF('4'!$D$19=4,\"Yes\",\"-\")","v":"-"},{"$f":"IF('4'!$D$19=0,0,IF('4'!$D$19<>4,1,0))","v":0}]
[]
[null,null,"Does the client comply with Environmental and Social (E&S) Laws and Regulations?",null,null,null,null,null,null,null,null,null,null,null,null,null,null,null,null,null,null,null,null,null,null,"Y/N"]
[null,null,"Best \nPractice",null,null,"Full Compliance with Relevant E&S Laws and Regulations: No evidence of punitive fines or penalties in the past two years. Evidence of active management oversight to ensure continued compliance with relevant E&S laws and regulations.",null,null,null,null,null,null,null,null,null,null,null,null,null,null,null,null,null,null,null,{"$f":"IF('4'!$D$20=1,\"Yes\",\"-\")","v":"-"},{"$f":"IF('4'!$D$20=0,0,IF('4'!$D$20<>1,1,0))","v":0}]
[null,null,"Good \nPractice",null,null,"Generally Compliant with Relevant E&S Laws and Regulations: The client may have been subject to fines or penalties in past two years, but these have been minor in nature and management action has been taken to address deficiencies. ",null,null,null,null,null,null,null,null,null,null,null,null,null,null,null,null,null,null,null,{"$f":"IF('4'!$D$20=2,\"Yes\",\"-\")","v":"-"},{"$f":"IF('4'!$D$20=0,0,IF('4'!$D$20<>2,1,0))","v":0}]
[null,null,"Satisfactory",null,null,"Limited Compliance with Relevant E&S Laws and Regulations: The client has been fined or sanctioned in the last two years (for minor and/or more significant failings) but demonstrates limited management oversight/capacity to address deficiencies in a systematic fashion.",null,null,null,null,null,null,null,null,null,null,null,null,null,null,null,null,null,null,null,{"$f":"IF('4'!$D$20=3,\"Yes\",\"-\")","v":"-"},{"$f":"IF('4'!$D$20=0,0,IF('4'!$D$20<>3,1,0))","v":0}]
[null,null,"Deficient",null,null,"Non-Compliance with Relevant E&S Laws and Regulations: Regular and systemic breaches of E&S laws and regulation resulting in punitive fines and penalties with no evidence to indicate management capacity or responsiveness to address deficiencies.",null,null,null,null,null,null,null,null,null,null,null,null,null,null,null,null,null,null,null,{"$f":"IF('4'!$D$20=4,\"Yes\",\"-\")","v":"-"},{"$f":"IF('4'!$D$20=0,0,IF('4'!$D$20<>4,1,0))","v":0}]
[]
[null,null,"How does the client report on Environmental and Social (E&S) issues?",null,null,null,null,null,null,null,null,null,null,null,null,null,null,null,null,null,null,null,null,null,null,"Y/N"]
[null,null,"Best \nPractice",null,null,"Strong E&S Reporting: The client publicly reports on its E&S performance using widely accepted metrics (e.g. Global Reporting Initiative or industry recognised sustainability reporting guidelines). E&S Reporting: (a) focuses on material issues; (b) demonstrates progress against stated performance objectives (e.g. SMART targets); (c) includes E&S performance of Third Parties; and (d) is assured by a third party (i.e. key E&S data sets).",null,null,null,null,null,null,null,null,null,null,null,null,null,null,null,null,null,null,null,{"$f":"IF('4'!$D$21=1,\"Yes\",\"-\")","v":"-"},{"$f":"IF('4'!$D$21=0,0,IF('4'!$D$21<>1,1,0))","v":0}]
[null,null,"Good \nPractice",null,null,"Adequate E&S Reporting: The client monitors and publicly reports on E&S performance covering all of its operations with defined key performance indicators (e.g. lost time injury rates and tonnes of carbon dioxide equivalent).  ",null,null,null,null,null,null,null,null,null,null,null,null,null,null,null,null,null,null,null,{"$f":"IF('4'!$D$21=2,\"Yes\",\"-\")","v":"-"},{"$f":"IF('4'!$D$21=0,0,IF('4'!$D$21<>2,1,0))","v":0}]
[null,null,"Satisfactory",null,null,"Limited E&S Reporting: Limited external reporting/disclosure of E&S performance. E&S reporting is collated internally, monitored and reported to senior management.",null,null,null,null,null,null,null,null,null,null,null,null,null,null,null,null,null,null,null,{"$f":"IF('4'!$D$21=3,\"Yes\",\"-\")","v":"-"},{"$f":"IF('4'!$D$21=0,0,IF('4'!$D$21<>3,1,0))","v":0}]
[null,null,"Deficient",null,null,"No E&S Reporting: The client does not report on E&S performance internally or externally.",null,null,null,null,null,null,null,null,null,null,null,null,null,null,null,null,null,null,null,{"$f":"IF('4'!$D$21=4,\"Yes\",\"-\")","v":"-"},{"$f":"IF('4'!$D$21=0,0,IF('4'!$D$21<>4,1,0))","v":0}]
[]
[null,null,"To what extent does the client manage labour relations?  ",null,null,null,null,null,null,null,null,null,null,null,null,null,null,null,null,null,null,null,null,null,null,"Y/N"]
[null,null,"Best \nPractice",null,null,"The client adheres to all national labour codes, the International Labour Organisation's conventions and recommendations, equality and diversity in the work force is promoted and there is at least one woman on the board.  There is a developed plan for training and the career development of employees, which all full time staff are entitled to.  The company solicits feedback from employees on how they perceive working for the company and there are clear grievance mechanisms for employees.",null,null,null,null,null,null,null,null,null,null,null,null,null,null,null,null,null,null,null,{"$f":"IF('4'!$D$22=1,\"Yes\",\"-\")","v":"-"},{"$f":"IF('4'!$D$22=0,0,IF('4'!$D$22<>1,1,0))","v":0}]
[null,null,"Good \nPractice",null,null,"The client adheres to all national labour codes, equality and diversity in the work force is promoted.  There is some training and career development of employees.  There are some grievance mechanisms for employees.",null,null,null,null,null,null,null,null,null,null,null,null,null,null,null,null,null,null,null,{"$f":"IF('4'!$D$22=2,\"Yes\",\"-\")","v":"-"},{"$f":"IF('4'!$D$22=0,0,IF('4'!$D$22<>2,1,0))","v":0}]
[null,null,"Satisfactory",null,null,"The client adheres to some national labour codes.  Equality and diversity in the work force is beginning to be considered.  Employees have sporadic training and development opportunities.  There are informal grievance mechanisms in place.",null,null,null,null,null,null,null,null,null,null,null,null,null,null,null,null,null,null,null,{"$f":"IF('4'!$D$22=3,\"Yes\",\"-\")","v":"-"},{"$f":"IF('4'!$D$22=0,0,IF('4'!$D$22<>3,1,0))","v":0}]
[null,null,"Deficient",null,null,"The client does not adhere to national labour codes.  Little regard is paid to equality and diversity in the work force.  Employees have few opportunities in the way of training and professional development.  There are no grievance mechanisms in place.",null,null,null,null,null,null,null,null,null,null,null,null,null,null,null,null,null,null,null,{"$f":"IF('4'!$D$22=4,\"Yes\",\"-\")","v":"-"},{"$f":"IF('4'!$D$22=0,0,IF('4'!$D$22<>4,1,0))","v":0}]
[]
[null,null,"To what extent does the client actively manage community investment activities?",null,null,null,null,null,null,null,null,null,null,null,null,null,null,null,null,null,null,null,null,null,null,"Y/N"]
[null,null,"Best \nPractice",null,null,"The client: (a) has a defined community investment strategy that links to the core business strategy; (b) understands the benefit of this strategy to itself and to its stakeholders; (c) measures the monetary value of its community investment activities including cash donation and in-kind giving (for example, employee volunteering during paid working hours, sponsoring apprenticeships or product or service donations); and (d) measures the impact and the effectiveness of its community investment activities.",null,null,null,null,null,null,null,null,null,null,null,null,null,null,null,null,null,null,null,{"$f":"IF('4'!$D$23=1,\"Yes\",\"-\")","v":"-"},{"$f":"IF('4'!$D$23=0,0,IF('4'!$D$23<>1,1,0))","v":0}]
[null,null,"Good \nPractice",null,null,"The client: (a) has a defined community investment strategy; and (b) measures the monetary value of its community investment activities including cash donation and in-kind giving (for example, employee volunteering during paid working hours or product/service donations/sponsoring apprenticeships).",null,null,null,null,null,null,null,null,null,null,null,null,null,null,null,null,null,null,null,{"$f":"IF('4'!$D$23=2,\"Yes\",\"-\")","v":"-"},{"$f":"IF('4'!$D$23=0,0,IF('4'!$D$23<>2,1,0))","v":0}]
[null,null,"Satisfactory",null,null,"The client: (a) actively supports community investment activities but does not have a defined strategy; and (b) donates money to charities and supports some other community investment activities as and when they arise (for example donating prizes, sponsoring events, or allowing employees to volunteer during working hours).  ",null,null,null,null,null,null,null,null,null,null,null,null,null,null,null,null,null,null,null,{"$f":"IF('4'!$D$23=3,\"Yes\",\"-\")","v":"-"},{"$f":"IF('4'!$D$23=0,0,IF('4'!$D$23<>3,1,0))","v":0}]
[null,null,"Deficient",null,null,"Community investment activities are not actively managed by the company.  Employees and/or local sites are involved in charitable activities on an ad hoc, individual basis.",null,null,null,null,null,null,null,null,null,null,null,null,null,null,null,null,null,null,null,{"$f":"IF('4'!$D$23=4,\"Yes\",\"-\")","v":"-"},{"$f":"IF('4'!$D$23=0,0,IF('4'!$D$23<>4,1,0))","v":0}]
[]
[]
[null,"5. Site Visit Checklist"]
[]
[]
[]
[null,null,null,null,null,"Safety",null,null,null,"Health",null,null,null,"Environment",null,null,null,"Labour and \nHuman Rights",null,null,null,"Community"]
[]
[null,null,null,null,null,{"$f":"'5.SiteVisitChecklist'!H7","v":0},null,null,null,{"$f":"'5.SiteVisitChecklist'!L7","v":0},null,null,null,{"$f":"'5.SiteVisitChecklist'!P7","v":0},null,null,null,{"$f":"'5.SiteVisitChecklist'!T7","v":0},null,null,null,{"$f":"'5.SiteVisitChecklist'!X7","v":0}]
[]
[]
[]
[null,null,"(i) Safety"]
[]
[null,null,"Which hazards/issues (either actual or potential) can you see on site?",null,null,null,null,null,null,null,null,null,null,null,null,null,null,"Y/N",null,"Comments"]
[null,null,"Falls from height",null,null,null,null,null,null,null,null,null,null,null,null,null,null,{"$f":"IF('5.SiteVisitChecklist'!R24=0,\"\",'5.SiteVisitChecklist'!R24)","v":""},null,{"$f":"IF('5.SiteVisitChecklist'!T24=0,\"\",'5.SiteVisitChecklist'!T24)","v":""}]
[null,null,"Movement of vehicles",null,null,null,null,null,null,null,null,null,null,null,null,null,null,{"$f":"IF('5.SiteVisitChecklist'!R25=0,\"\",'5.SiteVisitChecklist'!R25)","v":""}]
[null,null,"Road safety",null,null,null,null,null,null,null,null,null,null,null,null,null,null,{"$f":"IF('5.SiteVisitChecklist'!R26=0,\"\",'5.SiteVisitChecklist'!R26)","v":""}]
[null,null,"Confined spaces",null,null,null,null,null,null,null,null,null,null,null,null,null,null,{"$f":"IF('5.SiteVisitChecklist'!R27=0,\"\",'5.SiteVisitChecklist'!R27)","v":""}]
[null,null,"Fire safety",null,null,null,null,null,null,null,null,null,null,null,null,null,null,{"$f":"IF('5.SiteVisitChecklist'!R28=0,\"\",'5.SiteVisitChecklist'!R28)","v":""}]
[null,null,"Excavation safety",null,null,null,null,null,null,null,null,null,null,null,null,null,null,{"$f":"IF('5.SiteVisitChecklist'!R29=0,\"\",'5.SiteVisitChecklist'!R29)","v":""}]
[null,null,"Other",null,null,null,null,null,null,null,null,null,null,null,null,null,null,{"$f":"IF('5.SiteVisitChecklist'!R30=0,\"\",'5.SiteVisitChecklist'!R30)","v":""}]
[]
[null,null,"Documentation:",null,null,null,null,null,null,null,null,null,null,null,null,null,null,"Y/N",null,"Comments"]
[null,null,"Is there a Health and Safety Policy in place?",null,null,null,null,null,null,null,null,null,null,null,null,null,null,{"$f":"IF('5.SiteVisitChecklist'!R33=0,\"\",'5.SiteVisitChecklist'!R33)","v":""},null,{"$f":"IF('5.SiteVisitChecklist'!T33=0,\"\",'5.SiteVisitChecklist'!T33)","v":""}]
[null,null,"Is there a H&S notice board with information on fire wardens and first aiders?",null,null,null,null,null,null,null,null,null,null,null,null,null,null,{"$f":"IF('5.SiteVisitChecklist'!R34=0,\"\",'5.SiteVisitChecklist'!R34)","v":""}]
[null,null,"Have permits to work been obtained if necessary?",null,null,null,null,null,null,null,null,null,null,null,null,null,null,{"$f":"IF('5.SiteVisitChecklist'!R35=0,\"\",'5.SiteVisitChecklist'!R35)","v":""}]
[null,null,"Are there records showing that equipment is regularly inspected and maintained?",null,null,null,null,null,null,null,null,null,null,null,null,null,null,{"$f":"IF('5.SiteVisitChecklist'!R36=0,\"\",'5.SiteVisitChecklist'!R36)","v":""}]
[null,null,"Are there records which show that training has been provided for those carrying out potentially hazardous activities?",null,null,null,null,null,null,null,null,null,null,null,null,null,null,{"$f":"IF('5.SiteVisitChecklist'!R37=0,\"\",'5.SiteVisitChecklist'!R37)","v":""}]
[null,null,"Have any potential sources of ignition been identified?",null,null,null,null,null,null,null,null,null,null,null,null,null,null,{"$f":"IF('5.SiteVisitChecklist'!R38=0,\"\",'5.SiteVisitChecklist'!R38)","v":""}]
[]
[null,null,"Risk Avoidance and Mitigation:",null,null,null,null,null,null,null,null,null,null,null,null,null,null,"Y/N",null,"Comments"]
[null,null,"Is the site generally clean, tidy and kept free of trip hazards?",null,null,null,null,null,null,null,null,null,null,null,null,null,null,{"$f":"IF('5.SiteVisitChecklist'!R41=0,\"\",'5.SiteVisitChecklist'!R41)","v":""},null,{"$f":"IF('5.SiteVisitChecklist'!T41=0,\"\",'5.SiteVisitChecklist'!T41)","v":""}]
[null,null,"Are vehicles and pedestrians kept separate?",null,null,null,null,null,null,null,null,null,null,null,null,null,null,{"$f":"IF('5.SiteVisitChecklist'!R42=0,\"\",'5.SiteVisitChecklist'!R42)","v":""}]
[null,null,"Are vehicle windscreens, mirrors and lights clean and in good working condition?",null,null,null,null,null,null,null,null,null,null,null,null,null,null,{"$f":"IF('5.SiteVisitChecklist'!R43=0,\"\",'5.SiteVisitChecklist'!R43)","v":""}]
[null,null,"Are banksmen provided to help drivers?",null,null,null,null,null,null,null,null,null,null,null,null,null,null,{"$f":"IF('5.SiteVisitChecklist'!R44=0,\"\",'5.SiteVisitChecklist'!R44)","v":""}]
[null,null,"Are hazardous and/or flammable materials stored safely?",null,null,null,null,null,null,null,null,null,null,null,null,null,null,{"$f":"IF('5.SiteVisitChecklist'!R45=0,\"\",'5.SiteVisitChecklist'!R45)","v":""}]
[null,null,"Is the release of dangerous substances controlled at source? Is sufficient ventilation provided?",null,null,null,null,null,null,null,null,null,null,null,null,null,null,{"$f":"IF('5.SiteVisitChecklist'!R46=0,\"\",'5.SiteVisitChecklist'!R46)","v":""}]
[null,null,"Have excavation sides been supported effectively? Are vehicles and heavy materials kept away from the edges?",null,null,null,null,null,null,null,null,null,null,null,null,null,null,{"$f":"IF('5.SiteVisitChecklist'!R47=0,\"\",'5.SiteVisitChecklist'!R47)","v":""}]
[null,null,"Are ladders fastened at the top and bottom?",null,null,null,null,null,null,null,null,null,null,null,null,null,null,{"$f":"IF('5.SiteVisitChecklist'!R48=0,\"\",'5.SiteVisitChecklist'!R48)","v":""}]
[null,null,"Are fixed guard rails in place to prevent a fall?",null,null,null,null,null,null,null,null,null,null,null,null,null,null,{"$f":"IF('5.SiteVisitChecklist'!R49=0,\"\",'5.SiteVisitChecklist'!R49)","v":""}]
[null,null,"Are workers being supervised?",null,null,null,null,null,null,null,null,null,null,null,null,null,null,{"$f":"IF('5.SiteVisitChecklist'!R50=0,\"\",'5.SiteVisitChecklist'!R50)","v":""}]
[null,null,"Is gas detection equipment being used to monitor confined spaces?",null,null,null,null,null,null,null,null,null,null,null,null,null,null,{"$f":"IF('5.SiteVisitChecklist'!R51=0,\"\",'5.SiteVisitChecklist'!R51)","v":""}]
[null,null,"Are excavations suitably illuminated?",null,null,null,null,null,null,null,null,null,null,null,null,null,null,{"$f":"IF('5.SiteVisitChecklist'!R52=0,\"\",'5.SiteVisitChecklist'!R52)","v":""}]
[null,null,"Are excavations dry with no damaged services running through?",null,null,null,null,null,null,null,null,null,null,null,null,null,null,{"$f":"IF('5.SiteVisitChecklist'!R53=0,\"\",'5.SiteVisitChecklist'!R53)","v":""}]
[]
[null,null,"Protection:",null,null,null,null,null,null,null,null,null,null,null,null,null,null,"Y/N",null,"Comments"]
[null,null,"Is PPE readily available and in use?",null,null,null,null,null,null,null,null,null,null,null,null,null,null,{"$f":"IF('5.SiteVisitChecklist'!R56=0,\"\",'5.SiteVisitChecklist'!R56)","v":""},null,{"$f":"IF('5.SiteVisitChecklist'!T56=0,\"\",'5.SiteVisitChecklist'!T56)","v":""}]
[null,null,"Is there appropriate signage showing when PPE should be used?",null,null,null,null,null,null,null,null,null,null,null,null,null,null,{"$f":"IF('5.SiteVisitChecklist'!R57=0,\"\",'5.SiteVisitChecklist'!R57)","v":""}]
[null,null,"Is the correct PPE being used where needed? E.g. harnesses with double lanyards for people working at height; high visibility jackets for people working near vehicles; breathing apparatus for people working in confined spaces.",null,null,null,null,null,null,null,null,null,null,null,null,null,null,{"$f":"IF('5.SiteVisitChecklist'!R58=0,\"\",'5.SiteVisitChecklist'!R58)","v":""}]
[null,null,"Is firefighting equipment available in working areas?",null,null,null,null,null,null,null,null,null,null,null,null,null,null,{"$f":"IF('5.SiteVisitChecklist'!R59=0,\"\",'5.SiteVisitChecklist'!R59)","v":""}]
[]
[null,null,"(ii) Health"]
[]
[null,null,"Which hazards/issues (either actual or potential) can you see on site?",null,null,null,null,null,null,null,null,null,null,null,null,null,null,"Y/N",null,"Comments"]
[null,null,"Physical (e.g. noise, dust, fumes, asbestos, wet-working, vibration, manual handling etc.)",null,null,null,null,null,null,null,null,null,null,null,null,null,null,{"$f":"IF('5.SiteVisitChecklist'!R64=0,\"\",'5.SiteVisitChecklist'!R64)","v":""},null,{"$f":"IF('5.SiteVisitChecklist'!T64=0,\"\",'5.SiteVisitChecklist'!T64)","v":""}]
[null,null,"Chemical",null,null,null,null,null,null,null,null,null,null,null,null,null,null,{"$f":"IF('5.SiteVisitChecklist'!R65=0,\"\",'5.SiteVisitChecklist'!R65)","v":""}]
[null,null,"Biological",null,null,null,null,null,null,null,null,null,null,null,null,null,null,{"$f":"IF('5.SiteVisitChecklist'!R66=0,\"\",'5.SiteVisitChecklist'!R66)","v":""}]
[null,null,"Radiation",null,null,null,null,null,null,null,null,null,null,null,null,null,null,{"$f":"IF('5.SiteVisitChecklist'!R67=0,\"\",'5.SiteVisitChecklist'!R67)","v":""}]
[null,null,"Psychosocial (noise, poor lighting, thermal comfort etc.)",null,null,null,null,null,null,null,null,null,null,null,null,null,null,{"$f":"IF('5.SiteVisitChecklist'!R68=0,\"\",'5.SiteVisitChecklist'!R68)","v":""}]
[null,null,"Other",null,null,null,null,null,null,null,null,null,null,null,null,null,null,{"$f":"IF('5.SiteVisitChecklist'!R69=0,\"\",'5.SiteVisitChecklist'!R69)","v":""}]
[]
[null,null,"Documentation:",null,null,null,null,null,null,null,null,null,null,null,null,null,null,"Y/N",null,"Comments"]
[null,null,"Has a risk assessment been carried out for the handling of or exposure to dangerous substances?",null,null,null,null,null,null,null,null,null,null,null,null,null,null,{"$f":"IF('5.SiteVisitChecklist'!R72=0,\"\",'5.SiteVisitChecklist'!R72)","v":""},null,{"$f":"IF('5.SiteVisitChecklist'!T72=0,\"\",'5.SiteVisitChecklist'!T72)","v":""}]
[null,null,"Has a noise assessment been carried out and is noise monitored in work areas?",null,null,null,null,null,null,null,null,null,null,null,null,null,null,{"$f":"IF('5.SiteVisitChecklist'!R73=0,\"\",'5.SiteVisitChecklist'!R73)","v":""}]
[null,null,"Is there evidence of air quality monitoring?",null,null,null,null,null,null,null,null,null,null,null,null,null,null,{"$f":"IF('5.SiteVisitChecklist'!R74=0,\"\",'5.SiteVisitChecklist'!R74)","v":""}]
[null,null,"Is there an asbestos management plan in place?",null,null,null,null,null,null,null,null,null,null,null,null,null,null,{"$f":"IF('5.SiteVisitChecklist'!R75=0,\"\",'5.SiteVisitChecklist'!R75)","v":""}]
[null,null,"Are there records of the relevant authorities being notified if radiation is used?",null,null,null,null,null,null,null,null,null,null,null,null,null,null,{"$f":"IF('5.SiteVisitChecklist'!R76=0,\"\",'5.SiteVisitChecklist'!R76)","v":""}]
[null,null,"Is there evidence of noise assessments having been undertaken?",null,null,null,null,null,null,null,null,null,null,null,null,null,null,{"$f":"IF('5.SiteVisitChecklist'!R77=0,\"\",'5.SiteVisitChecklist'!R77)","v":""}]
[]
[null,null,"Risk Avoidance and Mitigation:",null,null,null,null,null,null,null,null,null,null,null,null,null,null,"Y/N",null,"Comments"]
[null,null,"Is the working environment clean in general?",null,null,null,null,null,null,null,null,null,null,null,null,null,null,{"$f":"IF('5.SiteVisitChecklist'!R80=0,\"\",'5.SiteVisitChecklist'!R80)","v":""},null,{"$f":"IF('5.SiteVisitChecklist'!T80=0,\"\",'5.SiteVisitChecklist'!T80)","v":""}]
[null,null,"Is there sufficient ventilation to prevent working in dust or fume laden air?",null,null,null,null,null,null,null,null,null,null,null,null,null,null,{"$f":"IF('5.SiteVisitChecklist'!R81=0,\"\",'5.SiteVisitChecklist'!R81)","v":""}]
[null,null,"Is noisy equipment enclosed or are acoustic barriers in place?",null,null,null,null,null,null,null,null,null,null,null,null,null,null,{"$f":"IF('5.SiteVisitChecklist'!R82=0,\"\",'5.SiteVisitChecklist'!R82)","v":""}]
[null,null,"Are there hoods over cutting devices?",null,null,null,null,null,null,null,null,null,null,null,null,null,null,{"$f":"IF('5.SiteVisitChecklist'!R83=0,\"\",'5.SiteVisitChecklist'!R83)","v":""}]
[null,null,"Does the site appear to be free from asbestos?",null,null,null,null,null,null,null,null,null,null,null,null,null,null,{"$f":"IF('5.SiteVisitChecklist'!R84=0,\"\",'5.SiteVisitChecklist'!R84)","v":""}]
[null,null,"Are there washing facilities to prevent hand to mouth/eye transfer?",null,null,null,null,null,null,null,null,null,null,null,null,null,null,{"$f":"IF('5.SiteVisitChecklist'!R85=0,\"\",'5.SiteVisitChecklist'!R85)","v":""}]
[null,null,"Are harmful substances disposed of safely?",null,null,null,null,null,null,null,null,null,null,null,null,null,null,{"$f":"IF('5.SiteVisitChecklist'!R86=0,\"\",'5.SiteVisitChecklist'!R86)","v":""}]
[null,null,"Are hazardous materials stored in designated labelled containers when in use?",null,null,null,null,null,null,null,null,null,null,null,null,null,null,{"$f":"IF('5.SiteVisitChecklist'!R87=0,\"\",'5.SiteVisitChecklist'!R87)","v":""}]
[null,null,"Is the site free from vermin?",null,null,null,null,null,null,null,null,null,null,null,null,null,null,{"$f":"IF('5.SiteVisitChecklist'!R88=0,\"\",'5.SiteVisitChecklist'!R88)","v":""}]
[null,null,"Are workers operating with enough space and light?",null,null,null,null,null,null,null,null,null,null,null,null,null,null,{"$f":"IF('5.SiteVisitChecklist'!R89=0,\"\",'5.SiteVisitChecklist'!R89)","v":""}]
[null,null,"Is there sufficient heating/cooling of indoor environments?",null,null,null,null,null,null,null,null,null,null,null,null,null,null,{"$f":"IF('5.SiteVisitChecklist'!R90=0,\"\",'5.SiteVisitChecklist'!R90)","v":""}]
[]
[null,null,"Protection:",null,null,null,null,null,null,null,null,null,null,null,null,null,null,"Y/N",null,"Comments"]
[null,null,"Is PPE used to prevent contact of harmful substances with the skin, eyes or respiratory system? For example, gloves, masks and protective glasses.",null,null,null,null,null,null,null,null,null,null,null,null,null,null,{"$f":"IF('5.SiteVisitChecklist'!R93=0,\"\",'5.SiteVisitChecklist'!R93)","v":""},null,{"$f":"IF('5.SiteVisitChecklist'!T93=0,\"\",'5.SiteVisitChecklist'!T93)","v":""}]
[null,null,"Is hearing protection used in noisy working environments?",null,null,null,null,null,null,null,null,null,null,null,null,null,null,{"$f":"IF('5.SiteVisitChecklist'!R94=0,\"\",'5.SiteVisitChecklist'!R94)","v":""}]
[null,null,"Is hand protection used where needles or sharps risks are present?",null,null,null,null,null,null,null,null,null,null,null,null,null,null,{"$f":"IF('5.SiteVisitChecklist'!R95=0,\"\",'5.SiteVisitChecklist'!R95)","v":""}]
[null,null,"Are workers provided with suitable warm and wet weather clothing? ",null,null,null,null,null,null,null,null,null,null,null,null,null,null,{"$f":"IF('5.SiteVisitChecklist'!R96=0,\"\",'5.SiteVisitChecklist'!R96)","v":""}]
[]
[null,null,"(iii) Environment"]
[]
[null,null,"Which hazards/issues (either actual or potential) can you see on site?",null,null,null,null,null,null,null,null,null,null,null,null,null,null,"Y/N",null,"Comments"]
[null,null,"Contaminated land",null,null,null,null,null,null,null,null,null,null,null,null,null,null,{"$f":"IF('5.SiteVisitChecklist'!R101=0,\"\",'5.SiteVisitChecklist'!R101)","v":""},null,{"$f":"IF('5.SiteVisitChecklist'!T101=0,\"\",'5.SiteVisitChecklist'!T101)","v":""}]
[null,null,"Waste water",null,null,null,null,null,null,null,null,null,null,null,null,null,null,{"$f":"IF('5.SiteVisitChecklist'!R102=0,\"\",'5.SiteVisitChecklist'!R102)","v":""}]
[null,null,"Air emissions",null,null,null,null,null,null,null,null,null,null,null,null,null,null,{"$f":"IF('5.SiteVisitChecklist'!R103=0,\"\",'5.SiteVisitChecklist'!R103)","v":""}]
[null,null,"Waste management",null,null,null,null,null,null,null,null,null,null,null,null,null,null,{"$f":"IF('5.SiteVisitChecklist'!R104=0,\"\",'5.SiteVisitChecklist'!R104)","v":""}]
[null,null,"Biodiversity",null,null,null,null,null,null,null,null,null,null,null,null,null,null,{"$f":"IF('5.SiteVisitChecklist'!R105=0,\"\",'5.SiteVisitChecklist'!R105)","v":""}]
[null,null,"Other",null,null,null,null,null,null,null,null,null,null,null,null,null,null,{"$f":"IF('5.SiteVisitChecklist'!R106=0,\"\",'5.SiteVisitChecklist'!R106)","v":""}]
[]
[null,null,"Documentation:",null,null,null,null,null,null,null,null,null,null,null,null,null,null,"Y/N",null,"Comments"]
[null,null,"Is there an adequate Environmental Policy in place?",null,null,null,null,null,null,null,null,null,null,null,null,null,null,{"$f":"IF('5.SiteVisitChecklist'!R109=0,\"\",'5.SiteVisitChecklist'!R109)","v":""},null,{"$f":"IF('5.SiteVisitChecklist'!T109=0,\"\",'5.SiteVisitChecklist'!T109)","v":""}]
[null,null,"Are any specialist reports available examining the site’s geology and history from a potential contamination viewpoint?",null,null,null,null,null,null,null,null,null,null,null,null,null,null,{"$f":"IF('5.SiteVisitChecklist'!R110=0,\"\",'5.SiteVisitChecklist'!R110)","v":""}]
[null,null,"Are there emissions/water discharge permits? Can you confirm that permitted emissions levels have not been exceeded? ",null,null,null,null,null,null,null,null,null,null,null,null,null,null,{"$f":"IF('5.SiteVisitChecklist'!R111=0,\"\",'5.SiteVisitChecklist'!R111)","v":""}]
[null,null,"Are underground installations such as storage tanks and sewer systems, where present, inspected regularly?",null,null,null,null,null,null,null,null,null,null,null,null,null,null,{"$f":"IF('5.SiteVisitChecklist'!R112=0,\"\",'5.SiteVisitChecklist'!R112)","v":""}]
[null,null,"Has an environmental risk assessment been carried out?",null,null,null,null,null,null,null,null,null,null,null,null,null,null,{"$f":"IF('5.SiteVisitChecklist'!R113=0,\"\",'5.SiteVisitChecklist'!R113)","v":""}]
[null,null,"Is there monitoring of habitats and species that have been translocated?",null,null,null,null,null,null,null,null,null,null,null,null,null,null,{"$f":"IF('5.SiteVisitChecklist'!R114=0,\"\",'5.SiteVisitChecklist'!R114)","v":""}]
[]
[null,null,"Risk Avoidance and Mitigation:",null,null,null,null,null,null,null,null,null,null,null,null,null,null,"Y/N",null,"Comments"]
[null,null,"Is there any past and present known contamination to soils or groundwater associated with the site, either through company activities or migrations from other sites?",null,null,null,null,null,null,null,null,null,null,null,null,null,null,{"$f":"IF('5.SiteVisitChecklist'!R117=0,\"\",'5.SiteVisitChecklist'!R117)","v":""},null,{"$f":"IF('5.SiteVisitChecklist'!T117=0,\"\",'5.SiteVisitChecklist'!T117)","v":""}]
[null,null,"Is the site free from evidence of leaks or spills around storage tanks/areas and process equipment?",null,null,null,null,null,null,null,null,null,null,null,null,null,null,{"$f":"IF('5.SiteVisitChecklist'!R118=0,\"\",'5.SiteVisitChecklist'!R118)","v":""}]
[null,null,"Is the site clear of any pools or puddles or stagnant water?",null,null,null,null,null,null,null,null,null,null,null,null,null,null,{"$f":"IF('5.SiteVisitChecklist'!R119=0,\"\",'5.SiteVisitChecklist'!R119)","v":""}]
[null,null,"Is waste water discharged away from water courses?",null,null,null,null,null,null,null,null,null,null,null,null,null,null,{"$f":"IF('5.SiteVisitChecklist'!R120=0,\"\",'5.SiteVisitChecklist'!R120)","v":""}]
[null,null,"If there are significant air emissions, is there evidence of the treatment of those emissions?",null,null,null,null,null,null,null,null,null,null,null,null,null,null,{"$f":"IF('5.SiteVisitChecklist'!R121=0,\"\",'5.SiteVisitChecklist'!R121)","v":""}]
[null,null,"Have efforts been made to ‘reduce, reuse or recycle’ waste in the first instance?",null,null,null,null,null,null,null,null,null,null,null,null,null,null,{"$f":"IF('5.SiteVisitChecklist'!R122=0,\"\",'5.SiteVisitChecklist'!R122)","v":""}]
[null,null,"Is there adequate on-site storage of waste? Is the site generally clean and free from waste?",null,null,null,null,null,null,null,null,null,null,null,null,null,null,{"$f":"IF('5.SiteVisitChecklist'!R123=0,\"\",'5.SiteVisitChecklist'!R123)","v":""}]
[]
[null,null,"Protection:",null,null,null,null,null,null,null,null,null,null,null,null,null,null,"Y/N",null,"Comments"]
[null,null,"Is there adequate protection, such as secondary containment, around storage tanks?",null,null,null,null,null,null,null,null,null,null,null,null,null,null,{"$f":"IF('5.SiteVisitChecklist'!R126=0,\"\",'5.SiteVisitChecklist'!R126)","v":""},null,{"$f":"IF('5.SiteVisitChecklist'!T126=0,\"\",'5.SiteVisitChecklist'!T126)","v":""}]
[null,null,"Are hazardous materials stored safely – e.g. in locked cages, and away from potential vehicle collision damage?",null,null,null,null,null,null,null,null,null,null,null,null,null,null,{"$f":"IF('5.SiteVisitChecklist'!R127=0,\"\",'5.SiteVisitChecklist'!R127)","v":""}]
[]
[null,null,"(iv) Labour and Human Rights"]
[]
[null,null,"Which hazards/issues (either actual or potential) can you identify from your site visit?",null,null,null,null,null,null,null,null,null,null,null,null,null,null,"Y/N",null,"Comments"]
[null,null,"Migrant labour",null,null,null,null,null,null,null,null,null,null,null,null,null,null,{"$f":"IF('5.SiteVisitChecklist'!R132=0,\"\",'5.SiteVisitChecklist'!R132)","v":""},null,{"$f":"IF('5.SiteVisitChecklist'!T132=0,\"\",'5.SiteVisitChecklist'!T132)","v":""}]
[null,null,"Poor working conditions",null,null,null,null,null,null,null,null,null,null,null,null,null,null,{"$f":"IF('5.SiteVisitChecklist'!R133=0,\"\",'5.SiteVisitChecklist'!R133)","v":""}]
[null,null,"Child labour",null,null,null,null,null,null,null,null,null,null,null,null,null,null,{"$f":"IF('5.SiteVisitChecklist'!R134=0,\"\",'5.SiteVisitChecklist'!R134)","v":""}]
[null,null,"Forced labour",null,null,null,null,null,null,null,null,null,null,null,null,null,null,{"$f":"IF('5.SiteVisitChecklist'!R135=0,\"\",'5.SiteVisitChecklist'!R135)","v":""}]
[null,null,"Other",null,null,null,null,null,null,null,null,null,null,null,null,null,null,{"$f":"IF('5.SiteVisitChecklist'!R136=0,\"\",'5.SiteVisitChecklist'!R136)","v":""}]
[]
[null,null,"Documentation:",null,null,null,null,null,null,null,null,null,null,null,null,null,null,"Y/N",null,"Comments"]
[null,null,"Do any migrant workers have the correct work permits?",null,null,null,null,null,null,null,null,null,null,null,null,null,null,{"$f":"IF('5.SiteVisitChecklist'!R139=0,\"\",'5.SiteVisitChecklist'!R139)","v":""},null,{"$f":"IF('5.SiteVisitChecklist'!T139=0,\"\",'5.SiteVisitChecklist'!T139)","v":""}]
[null,null,"Do contracts of work show that working hours, breaks and time off are all in line with local regulations?",null,null,null,null,null,null,null,null,null,null,null,null,null,null,{"$f":"IF('5.SiteVisitChecklist'!R140=0,\"\",'5.SiteVisitChecklist'!R140)","v":""}]
[null,null,"Can the management confirm that employees are being paid a wage and are not working under debt obligations? ",null,null,null,null,null,null,null,null,null,null,null,null,null,null,{"$f":"IF('5.SiteVisitChecklist'!R141=0,\"\",'5.SiteVisitChecklist'!R141)","v":""}]
[null,null,"Can the management provide evidence to confirm the ages of the workforce?",null,null,null,null,null,null,null,null,null,null,null,null,null,null,{"$f":"IF('5.SiteVisitChecklist'!R142=0,\"\",'5.SiteVisitChecklist'!R142)","v":""}]
[]
[null,null,"Risk Avoidance and Mitigation:",null,null,null,null,null,null,null,null,null,null,null,null,null,null,"Y/N",null,"Comments"]
[null,null,"Are workers provided with a safe and hygienic workplace?",null,null,null,null,null,null,null,null,null,null,null,null,null,null,{"$f":"IF('5.SiteVisitChecklist'!R145=0,\"\",'5.SiteVisitChecklist'!R145)","v":""},null,{"$f":"IF('5.SiteVisitChecklist'!T145=0,\"\",'5.SiteVisitChecklist'!T145)","v":""}]
[null,null,"Do workers appear to be able to leave the site of their own free will? Look out for accommodation on site or workers being transported to site.",null,null,null,null,null,null,null,null,null,null,null,null,null,null,{"$f":"IF('5.SiteVisitChecklist'!R146=0,\"\",'5.SiteVisitChecklist'!R146)","v":""}]
[null,null,"Is any worker accommodation clean and of sufficient quality?",null,null,null,null,null,null,null,null,null,null,null,null,null,null,{"$f":"IF('5.SiteVisitChecklist'!R147=0,\"\",'5.SiteVisitChecklist'!R147)","v":""}]
[null,null,"Do all workers appear to be over the legal working age?",null,null,null,null,null,null,null,null,null,null,null,null,null,null,{"$f":"IF('5.SiteVisitChecklist'!R148=0,\"\",'5.SiteVisitChecklist'!R148)","v":""}]
[]
[null,null,"(v) Community"]
[]
[null,null,"Which issues have (or could potentially have) an impact on the local community?",null,null,null,null,null,null,null,null,null,null,null,null,null,null,"Y/N",null,"Comments"]
[null,null,"Safety – Does the site activity mean that the community cannot operate safely? Could an explosion or other such incident at the site affect the community?",null,null,null,null,null,null,null,null,null,null,null,null,null,null,{"$f":"IF('5.SiteVisitChecklist'!R153=0,\"\",'5.SiteVisitChecklist'!R153)","v":""},null,{"$f":"IF('5.SiteVisitChecklist'!T153=0,\"\",'5.SiteVisitChecklist'!T153)","v":""}]
[null,null,"Environment – Do the activities on the site impact the local environment?",null,null,null,null,null,null,null,null,null,null,null,null,null,null,{"$f":"IF('5.SiteVisitChecklist'!R154=0,\"\",'5.SiteVisitChecklist'!R154)","v":""}]
[null,null,"Nuisance – Is there disruption to the community (e.g. noise, smell, vehicle movements)?",null,null,null,null,null,null,null,null,null,null,null,null,null,null,{"$f":"IF('5.SiteVisitChecklist'!R155=0,\"\",'5.SiteVisitChecklist'!R155)","v":""}]
[null,null,"Security personnel – Do they pose a risk to the community?",null,null,null,null,null,null,null,null,null,null,null,null,null,null,{"$f":"IF('5.SiteVisitChecklist'!R156=0,\"\",'5.SiteVisitChecklist'!R156)","v":""}]
[null,null,"Other",null,null,null,null,null,null,null,null,null,null,null,null,null,null,{"$f":"IF('5.SiteVisitChecklist'!R157=0,\"\",'5.SiteVisitChecklist'!R157)","v":""}]
[]
[null,null,"Documentation:",null,null,null,null,null,null,null,null,null,null,null,null,null,null,"Y/N",null,"Comments"]
[null,null,"Is there a policy in place related to community/stakeholder relations or community investment? ",null,null,null,null,null,null,null,null,null,null,null,null,null,null,{"$f":"IF('5.SiteVisitChecklist'!R160=0,\"\",'5.SiteVisitChecklist'!R160)","v":""},null,{"$f":"IF('5.SiteVisitChecklist'!T160=0,\"\",'5.SiteVisitChecklist'!T160)","v":""}]
[null,null,"Is there appropriate public liability insurance policy in place?",null,null,null,null,null,null,null,null,null,null,null,null,null,null,{"$f":"IF('5.SiteVisitChecklist'!R161=0,\"\",'5.SiteVisitChecklist'!R161)","v":""}]
[null,null,"Can management provide documentation showing that security personnel have been checked for involvement in past abuse and have been trained on how to interact with the community?",null,null,null,null,null,null,null,null,null,null,null,null,null,null,{"$f":"IF('5.SiteVisitChecklist'!R162=0,\"\",'5.SiteVisitChecklist'!R162)","v":""}]
[null,null,"Is there a documented method for complaints to be logged?",null,null,null,null,null,null,null,null,null,null,null,null,null,null,{"$f":"IF('5.SiteVisitChecklist'!R163=0,\"\",'5.SiteVisitChecklist'!R163)","v":""}]
[null,null,"Has the company conducted a study to assess the likely impact of an explosion, gas leak, etc. if relevant?",null,null,null,null,null,null,null,null,null,null,null,null,null,null,{"$f":"IF('5.SiteVisitChecklist'!R164=0,\"\",'5.SiteVisitChecklist'!R164)","v":""}]
[]
[null,null,"Risk Avoidance and Mitigation:",null,null,null,null,null,null,null,null,null,null,null,null,null,null,"Y/N",null,"Comments"]
[null,null,"Is public access to the site and equipment limited?",null,null,null,null,null,null,null,null,null,null,null,null,null,null,{"$f":"IF('5.SiteVisitChecklist'!R167=0,\"\",'5.SiteVisitChecklist'!R167)","v":""},null,{"$f":"IF('5.SiteVisitChecklist'!T167=0,\"\",'5.SiteVisitChecklist'!T167)","v":""}]
[null,null,"If site operations could create a fire/explosion/flood, has this risk been controlled? How?",null,null,null,null,null,null,null,null,null,null,null,null,null,null,{"$f":"IF('5.SiteVisitChecklist'!R168=0,\"\",'5.SiteVisitChecklist'!R168)","v":""}]
[null,null,"Is there provision to contain any firefighting water run-off?",null,null,null,null,null,null,null,null,null,null,null,null,null,null,{"$f":"IF('5.SiteVisitChecklist'!R169=0,\"\",'5.SiteVisitChecklist'!R169)","v":""}]
[null,null,"Have spills and leaks which may impact upon the community been prevented?",null,null,null,null,null,null,null,null,null,null,null,null,null,null,{"$f":"IF('5.SiteVisitChecklist'!R170=0,\"\",'5.SiteVisitChecklist'!R170)","v":""}]
[null,null,"Are vehicle movements and timings considerate to the local community?",null,null,null,null,null,null,null,null,null,null,null,null,null,null,{"$f":"IF('5.SiteVisitChecklist'!R171=0,\"\",'5.SiteVisitChecklist'!R171)","v":""}]
[null,null,"Is the site free from any strong odours or significant noise/dust which may affect the local community?",null,null,null,null,null,null,null,null,null,null,null,null,null,null,{"$f":"IF('5.SiteVisitChecklist'!R172=0,\"\",'5.SiteVisitChecklist'!R172)","v":""}]
[null,null,"Is the site located away from residential areas?",null,null,null,null,null,null,null,null,null,null,null,null,null,null,{"$f":"IF('5.SiteVisitChecklist'!R173=0,\"\",'5.SiteVisitChecklist'!R173)","v":""}]
[null,null,"Can management confirm that there is a good relationship with the local community?",null,null,null,null,null,null,null,null,null,null,null,null,null,null,{"$f":"IF('5.SiteVisitChecklist'!R174=0,\"\",'5.SiteVisitChecklist'!R174)","v":""}]
[]
[]
[]
[null,null,"Disclaimer:"]
[]
[null,null,"Note that this guidance only covers a number of commonly found E&S risks and issues you may find during a site visit. This is not an exhaustive list of E&S risks and issues, and you should look out for potential risks that are not outlined here."]
[]
[null,null,"This guidance does not provide detailed technical information on the issues identified, but provides you with some key questions to ask, to understand how a customer is managing E&S risks. In addition to this guidance, you should review EBRD’s Sub-sectoral guidelines for more information. Where you have concerns about conducting an operational site visit, you may wish to use a specialist E&S consultancy to support you."]

{"sheet":"2a","index":10,"n_rows":338,"n_cols":21,"rows_kept":338,"cut":false,"hidden":true,"merged":[]}
[null,"2a. E&S Risk Mapping"]
[]
[]
[null,null,"DD_LendingType"]
[null,null,"Corporate loan"]
[null,null,"SME loan"]
[null,null,"Equity_active"]
[null,null,"Equity_passive"]
[]
[null,null,null,null,null,"OverallRiskMatrix"]
[null,null,"DD_LengthOfLoan",null,"Low","Medium","High"]
[null,null,"Long (>3yr)",null,"Medium","High","High",{"$f":"$C$5&C12","v":"Corporate loanLong (>3yr)"}]
[null,null,"Medium (1-3yr)",null,"Low","Medium","High",{"$f":"$C$5&C13","v":"Corporate loanMedium (1-3yr)"}]
[null,null,"Short (<1yr)",null,"Low","Medium","Medium",{"$f":"$C$5&C14","v":"Corporate loanShort (<1yr)"}]
[null,null,"Long (>2yr)",null,"Low","Medium","High",{"$f":"$C$6&C15","v":"SME loanLong (>2yr)"}]
[null,null,"Medium (0.5-2yr)",null,"Low","Medium","High",{"$f":"$C$6&C16","v":"SME loanMedium (0.5-2yr)"}]
[null,null,"Short (<0.5yr)",null,"Low","Low","Low",{"$f":"$C$6&C17","v":"SME loanShort (<0.5yr)"}]
[null,null,"[n/a]",null,"Low","Medium","High",{"$f":"$C$7&C18","v":"Equity_active[n/a]"}]
[null,null,"[n/a]",null,"Low","Medium","High",{"$f":"$C$8&C19","v":"Equity_passive[n/a]"}]
[]
[null,null,null,null,null,null,null,null,null,null,"SectorRiskScore",null,"IssueTable","Guideline"]
[null,null,"DD_Country",null,"SectorID","NACE code","Section","Category","Subcategory","Environmental","Social","Overall","t#","Status",null,"UL_Category","UL_Subcategory",null,"DD_Section","DD_Category","DD_Subcategory"]
[null,null,"Akrotiri",null,{"$f":"G23&H23&I23","v":"Agriculture, forestry and fishingCrop and animal production, hunting and related service activitiesGrowing of cereals (except rice), leguminous crops and oil seeds"},"1.11","Agriculture, forestry and fishing","Crop and animal production, hunting and related service activities","Growing of cereals (except rice), leguminous crops and oil seeds","Medium","High","Medium","t115","Not yet drafted",null,{"$f":"IF($G23=Section,\nIF(COUNTIFS(P$22:P22,$H23)=0,$H23,0),\n0)","v":0},{"$f":"IF(AND($G23=Section,$H23=Category),\nIF(COUNTIFS(Q$22:Q22,$I23)=0,$I23,0),\n0)","v":0},null,"Accommodation and food service activities",{"$f":"IFERROR(     INDEX(P23:P339,MATCH(\"*\",P23:P339,0)),     \"{Please select}\")","v":"{Please select}"},{"$f":"IFERROR(     INDEX(Q23:Q339,MATCH(\"*\",Q23:Q339,0)),     \"{Please select}\")","v":"{Please select}"}]
[null,null,"Albania",null,{"$f":"G24&H24&I24","v":"Agriculture, forestry and fishingCrop and animal production, hunting and related service activitiesGrowing of rice"},"1.12","Agriculture, forestry and fishing","Crop and animal production, hunting and related service activities","Growing of rice","Medium","High","High","t115","Not yet drafted",null,{"$f":"IF($G24=Section,\nIF(COUNTIFS(P$22:P23,$H24)=0,$H24,0),\n0)","v":0},{"$f":"IF(AND($G24=Section,$H24=Category),\nIF(COUNTIFS(Q$22:Q23,$I24)=0,$I24,0),\n0)","v":0},null,"Activities of extraterritorial organisations and bodies, e.g. diplomatic and consular missions, international organisations, etc.",{"$f":"IFERROR(\nINDEX(OFFSET(P23,MATCH(\"\"&T23,P23:P$339,0),0):P$339,MATCH(\"*\",OFFSET(P23,MATCH(\"\"&T23,P23:P$339,0),0):P$339,0)),\n0)","v":0},{"$f":"IFERROR(\nINDEX(OFFSET(Q23,MATCH(\"\"&U23,Q23:Q$339,0),0):Q$339,MATCH(\"*\",OFFSET(Q23,MATCH(\"\"&U23,Q23:Q$339,0),0):Q$339,0)),\n0)","v":0}]
[null,null,"Algeria",null,"Agriculture, forestry and fishingCrop and animal production, hunting and related service activitiesGrowing of vegetables and melons, roots and tubers","1.13","Agriculture, forestry and fishing","Crop and animal production, hunting and related service activities","Growing of vegetables and melons, roots and tubers","Medium","High","High","t115","Not yet drafted",null,{"$f":"IF($G25=Section,\nIF(COUNTIFS(P$22:P24,$H25)=0,$H25,0),\n0)","v":0},{"$f":"IF(AND($G25=Section,$H25=Category),\nIF(COUNTIFS(Q$22:Q24,$I25)=0,$I25,0),\n0)","v":0},null,"Activities of households as employers; undifferentiated goods and services producing activities of households for own use",{"$f":"IFERROR(\nINDEX(OFFSET(P24,MATCH(\"\"&T24,P24:P$339,0),0):P$339,MATCH(\"*\",OFFSET(P24,MATCH(\"\"&T24,P24:P$339,0),0):P$339,0)),\n0)","v":0},{"$f":"IFERROR(\nINDEX(OFFSET(Q24,MATCH(\"\"&U24,Q24:Q$339,0),0):Q$339,MATCH(\"*\",OFFSET(Q24,MATCH(\"\"&U24,Q24:Q$339,0),0):Q$339,0)),\n0)","v":0}]
[null,null,"Andorra",null,"Agriculture, forestry and fishingCrop and animal production, hunting and related service activitiesGrowing of sugar cane","1.14","Agriculture, forestry and fishing","Crop and animal production, hunting and related service activities","Growing of sugar cane","Medium","High","High","t115","Not yet drafted",null,{"$f":"IF($G26=Section,\nIF(COUNTIFS(P$22:P25,$H26)=0,$H26,0),\n0)","v":0},{"$f":"IF(AND($G26=Section,$H26=Category),\nIF(COUNTIFS(Q$22:Q25,$I26)=0,$I26,0),\n0)","v":0},null,"Administrative and support service activities",{"$f":"IFERROR(\nINDEX(OFFSET(P25,MATCH(\"\"&T25,P25:P$339,0),0):P$339,MATCH(\"*\",OFFSET(P25,MATCH(\"\"&T25,P25:P$339,0),0):P$339,0)),\n0)","v":0},{"$f":"IFERROR(\nINDEX(OFFSET(Q25,MATCH(\"\"&U25,Q25:Q$339,0),0):Q$339,MATCH(\"*\",OFFSET(Q25,MATCH(\"\"&U25,Q25:Q$339,0),0):Q$339,0)),\n0)","v":0}]
[null,null,"Angola",null,"Agriculture, forestry and fishingCrop and animal production, hunting and related service activitiesGrowing of tobacco","1.15","Agriculture, forestry and fishing","Crop and animal production, hunting and related service activities","Growing of tobacco","Excluded","Excluded","Excluded","[n/a]","[n/a]",null,{"$f":"IF($G27=Section,\nIF(COUNTIFS(P$22:P26,$H27)=0,$H27,0),\n0)","v":0},{"$f":"IF(AND($G27=Section,$H27=Category),\nIF(COUNTIFS(Q$22:Q26,$I27)=0,$I27,0),\n0)","v":0},null,"Agriculture, forestry and fishing",{"$f":"IFERROR(\nINDEX(OFFSET(P26,MATCH(\"\"&T26,P26:P$339,0),0):P$339,MATCH(\"*\",OFFSET(P26,MATCH(\"\"&T26,P26:P$339,0),0):P$339,0)),\n0)","v":0},{"$f":"IFERROR(\nINDEX(OFFSET(Q26,MATCH(\"\"&U26,Q26:Q$339,0),0):Q$339,MATCH(\"*\",OFFSET(Q26,MATCH(\"\"&U26,Q26:Q$339,0),0):Q$339,0)),\n0)","v":0}]
[null,null,"Armenia",null,"Agriculture, forestry and fishingCrop and animal production, hunting and related service activitiesGrowing of fibre crops (e.g. jute, flax, hemp, cotton)","1.16","Agriculture, forestry and fishing","Crop and animal production, hunting and related service activities","Growing of fibre crops (e.g. jute, flax, hemp, cotton)","Medium","High","High","t115","Not yet drafted",null,{"$f":"IF($G28=Section,\nIF(COUNTIFS(P$22:P27,$H28)=0,$H28,0),\n0)","v":0},{"$f":"IF(AND($G28=Section,$H28=Category),\nIF(COUNTIFS(Q$22:Q27,$I28)=0,$I28,0),\n0)","v":0},null,"Arts, entertainment and recreation",{"$f":"IFERROR(\nINDEX(OFFSET(P27,MATCH(\"\"&T27,P27:P$339,0),0):P$339,MATCH(\"*\",OFFSET(P27,MATCH(\"\"&T27,P27:P$339,0),0):P$339,0)),\n0)","v":0},{"$f":"IFERROR(\nINDEX(OFFSET(Q27,MATCH(\"\"&U27,Q27:Q$339,0),0):Q$339,MATCH(\"*\",OFFSET(Q27,MATCH(\"\"&U27,Q27:Q$339,0),0):Q$339,0)),\n0)","v":0}]
[null,null,"Austria",null,"Agriculture, forestry and fishingCrop and animal production, hunting and related service activitiesGrowing of other non-perennial crops, e.g. flowers, flower seeds, etc.","1.19","Agriculture, forestry and fishing","Crop and animal production, hunting and related service activities","Growing of other non-perennial crops, e.g. flowers, flower seeds, etc.","Medium","High","High","t115","Not yet drafted",null,{"$f":"IF($G29=Section,\nIF(COUNTIFS(P$22:P28,$H29)=0,$H29,0),\n0)","v":0},{"$f":"IF(AND($G29=Section,$H29=Category),\nIF(COUNTIFS(Q$22:Q28,$I29)=0,$I29,0),\n0)","v":0},null,"Construction",{"$f":"IFERROR(\nINDEX(OFFSET(P28,MATCH(\"\"&T28,P28:P$339,0),0):P$339,MATCH(\"*\",OFFSET(P28,MATCH(\"\"&T28,P28:P$339,0),0):P$339,0)),\n0)","v":0},{"$f":"IFERROR(\nINDEX(OFFSET(Q28,MATCH(\"\"&U28,Q28:Q$339,0),0):Q$339,MATCH(\"*\",OFFSET(Q28,MATCH(\"\"&U28,Q28:Q$339,0),0):Q$339,0)),\n0)","v":0}]
[null,null,"Azerbaijan",null,"Agriculture, forestry and fishingCrop and animal production, hunting and related service activitiesGrowing of perennial crops (i.e. plants that last for more than two growing seasons)","1.2","Agriculture, forestry and fishing","Crop and animal production, hunting and related service activities","Growing of perennial crops (i.e. plants that last for more than two growing seasons)","Medium","High","High","t115","Not yet drafted",null,{"$f":"IF($G30=Section,\nIF(COUNTIFS(P$22:P29,$H30)=0,$H30,0),\n0)","v":0},{"$f":"IF(AND($G30=Section,$H30=Category),\nIF(COUNTIFS(Q$22:Q29,$I30)=0,$I30,0),\n0)","v":0},null,"Education",{"$f":"IFERROR(\nINDEX(OFFSET(P29,MATCH(\"\"&T29,P29:P$339,0),0):P$339,MATCH(\"*\",OFFSET(P29,MATCH(\"\"&T29,P29:P$339,0),0):P$339,0)),\n0)","v":0},{"$f":"IFERROR(\nINDEX(OFFSET(Q29,MATCH(\"\"&U29,Q29:Q$339,0),0):Q$339,MATCH(\"*\",OFFSET(Q29,MATCH(\"\"&U29,Q29:Q$339,0),0):Q$339,0)),\n0)","v":0}]
[null,null,"Bahrain",null,"Agriculture, forestry and fishingCrop and animal production, hunting and related service activitiesPlant propagation (i.e. for ornamental purposes, including turf for transplanting, etc.)","1.3","Agriculture, forestry and fishing","Crop and animal production, hunting and related service activities","Plant propagation (i.e. for ornamental purposes, including turf for transplanting, etc.)","Low","Low","Low","[n/a]","[n/a]",null,{"$f":"IF($G31=Section,\nIF(COUNTIFS(P$22:P30,$H31)=0,$H31,0),\n0)","v":0},{"$f":"IF(AND($G31=Section,$H31=Category),\nIF(COUNTIFS(Q$22:Q30,$I31)=0,$I31,0),\n0)","v":0},null,"Electricity, gas steam and air conditioning supply",{"$f":"IFERROR(\nINDEX(OFFSET(P30,MATCH(\"\"&T30,P30:P$339,0),0):P$339,MATCH(\"*\",OFFSET(P30,MATCH(\"\"&T30,P30:P$339,0),0):P$339,0)),\n0)","v":0},{"$f":"IFERROR(\nINDEX(OFFSET(Q30,MATCH(\"\"&U30,Q30:Q$339,0),0):Q$339,MATCH(\"*\",OFFSET(Q30,MATCH(\"\"&U30,Q30:Q$339,0),0):Q$339,0)),\n0)","v":0}]
[null,null,"Bassas da India",null,"Agriculture, forestry and fishingCrop and animal production, hunting and related service activitiesRaising of dairy cattle","1.41","Agriculture, forestry and fishing","Crop and animal production, hunting and related service activities","Raising of dairy cattle","Medium","Medium","Medium","t117","Not yet drafted",null,{"$f":"IF($G32=Section,\nIF(COUNTIFS(P$22:P31,$H32)=0,$H32,0),\n0)","v":0},{"$f":"IF(AND($G32=Section,$H32=Category),\nIF(COUNTIFS(Q$22:Q31,$I32)=0,$I32,0),\n0)","v":0},null,"Financial and insurance activities",{"$f":"IFERROR(\nINDEX(OFFSET(P31,MATCH(\"\"&T31,P31:P$339,0),0):P$339,MATCH(\"*\",OFFSET(P31,MATCH(\"\"&T31,P31:P$339,0),0):P$339,0)),\n0)","v":0},{"$f":"IFERROR(\nINDEX(OFFSET(Q31,MATCH(\"\"&U31,Q31:Q$339,0),0):Q$339,MATCH(\"*\",OFFSET(Q31,MATCH(\"\"&U31,Q31:Q$339,0),0):Q$339,0)),\n0)","v":0}]
[null,null,"Belarus",null,"Agriculture, forestry and fishingCrop and animal production, hunting and related service activitiesRaising of other cattle and buffaloes","1.42","Agriculture, forestry and fishing","Crop and animal production, hunting and related service activities","Raising of other cattle and buffaloes","Medium","Medium","Medium","t114","Not yet drafted",null,{"$f":"IF($G33=Section,\nIF(COUNTIFS(P$22:P32,$H33)=0,$H33,0),\n0)","v":0},{"$f":"IF(AND($G33=Section,$H33=Category),\nIF(COUNTIFS(Q$22:Q32,$I33)=0,$I33,0),\n0)","v":0},null,"Human health and social work activities",{"$f":"IFERROR(\nINDEX(OFFSET(P32,MATCH(\"\"&T32,P32:P$339,0),0):P$339,MATCH(\"*\",OFFSET(P32,MATCH(\"\"&T32,P32:P$339,0),0):P$339,0)),\n0)","v":0},{"$f":"IFERROR(\nINDEX(OFFSET(Q32,MATCH(\"\"&U32,Q32:Q$339,0),0):Q$339,MATCH(\"*\",OFFSET(Q32,MATCH(\"\"&U32,Q32:Q$339,0),0):Q$339,0)),\n0)","v":0}]
[null,null,"Belgium",null,"Agriculture, forestry and fishingCrop and animal production, hunting and related service activitiesRaising of horses and other equines","1.43","Agriculture, forestry and fishing","Crop and animal production, hunting and related service activities","Raising of horses and other equines","Medium","Medium","Medium","t114","Not yet drafted",null,{"$f":"IF($G34=Section,\nIF(COUNTIFS(P$22:P33,$H34)=0,$H34,0),\n0)","v":0},{"$f":"IF(AND($G34=Section,$H34=Category),\nIF(COUNTIFS(Q$22:Q33,$I34)=0,$I34,0),\n0)","v":0},null,"Information and communication",{"$f":"IFERROR(\nINDEX(OFFSET(P33,MATCH(\"\"&T33,P33:P$339,0),0):P$339,MATCH(\"*\",OFFSET(P33,MATCH(\"\"&T33,P33:P$339,0),0):P$339,0)),\n0)","v":0},{"$f":"IFERROR(\nINDEX(OFFSET(Q33,MATCH(\"\"&U33,Q33:Q$339,0),0):Q$339,MATCH(\"*\",OFFSET(Q33,MATCH(\"\"&U33,Q33:Q$339,0),0):Q$339,0)),\n0)","v":0}]
[null,null,"Benin",null,"Agriculture, forestry and fishingCrop and animal production, hunting and related service activitiesRaising of camels and camelids","1.44","Agriculture, forestry and fishing","Crop and animal production, hunting and related service activities","Raising of camels and camelids","Medium","Medium","Medium","t114","Not yet drafted",null,{"$f":"IF($G35=Section,\nIF(COUNTIFS(P$22:P34,$H35)=0,$H35,0),\n0)","v":0},{"$f":"IF(AND($G35=Section,$H35=Category),\nIF(COUNTIFS(Q$22:Q34,$I35)=0,$I35,0),\n0)","v":0},null,"Manufacturing",{"$f":"IFERROR(\nINDEX(OFFSET(P34,MATCH(\"\"&T34,P34:P$339,0),0):P$339,MATCH(\"*\",OFFSET(P34,MATCH(\"\"&T34,P34:P$339,0),0):P$339,0)),\n0)","v":0},{"$f":"IFERROR(\nINDEX(OFFSET(Q34,MATCH(\"\"&U34,Q34:Q$339,0),0):Q$339,MATCH(\"*\",OFFSET(Q34,MATCH(\"\"&U34,Q34:Q$339,0),0):Q$339,0)),\n0)","v":0}]
[null,null,"Bosnia and Herzegovina",null,"Agriculture, forestry and fishingCrop and animal production, hunting and related service activitiesRaising of sheep and goats","1.45","Agriculture, forestry and fishing","Crop and animal production, hunting and related service activities","Raising of sheep and goats","Medium","Medium","Medium","t114","Not yet drafted",null,{"$f":"IF($G36=Section,\nIF(COUNTIFS(P$22:P35,$H36)=0,$H36,0),\n0)","v":0},{"$f":"IF(AND($G36=Section,$H36=Category),\nIF(COUNTIFS(Q$22:Q35,$I36)=0,$I36,0),\n0)","v":0},null,"Mining and quarrying",{"$f":"IFERROR(\nINDEX(OFFSET(P35,MATCH(\"\"&T35,P35:P$339,0),0):P$339,MATCH(\"*\",OFFSET(P35,MATCH(\"\"&T35,P35:P$339,0),0):P$339,0)),\n0)","v":0},{"$f":"IFERROR(\nINDEX(OFFSET(Q35,MATCH(\"\"&U35,Q35:Q$339,0),0):Q$339,MATCH(\"*\",OFFSET(Q35,MATCH(\"\"&U35,Q35:Q$339,0),0):Q$339,0)),\n0)","v":0}]
[null,null,"Botswana",null,"Agriculture, forestry and fishingCrop and animal production, hunting and related service activitiesRaising of swine/pigs","1.46","Agriculture, forestry and fishing","Crop and animal production, hunting and related service activities","Raising of swine/pigs","Medium","Medium","Medium","t114","Not yet drafted",null,{"$f":"IF($G37=Section,\nIF(COUNTIFS(P$22:P36,$H37)=0,$H37,0),\n0)","v":0},{"$f":"IF(AND($G37=Section,$H37=Category),\nIF(COUNTIFS(Q$22:Q36,$I37)=0,$I37,0),\n0)","v":0},null,"Other service activities",{"$f":"IFERROR(\nINDEX(OFFSET(P36,MATCH(\"\"&T36,P36:P$339,0),0):P$339,MATCH(\"*\",OFFSET(P36,MATCH(\"\"&T36,P36:P$339,0),0):P$339,0)),\n0)","v":0},{"$f":"IFERROR(\nINDEX(OFFSET(Q36,MATCH(\"\"&U36,Q36:Q$339,0),0):Q$339,MATCH(\"*\",OFFSET(Q36,MATCH(\"\"&U36,Q36:Q$339,0),0):Q$339,0)),\n0)","v":0}]
[null,null,"Bulgaria",null,"Agriculture, forestry and fishingCrop and animal production, hunting and related service activitiesRaising of poultry","1.47","Agriculture, forestry and fishing","Crop and animal production, hunting and related service activities","Raising of poultry","Medium","Medium","Medium","t114","Not yet drafted",null,{"$f":"IF($G38=Section,\nIF(COUNTIFS(P$22:P37,$H38)=0,$H38,0),\n0)","v":0},{"$f":"IF(AND($G38=Section,$H38=Category),\nIF(COUNTIFS(Q$22:Q37,$I38)=0,$I38,0),\n0)","v":0},null,"Professional scientific and technical activities",{"$f":"IFERROR(\nINDEX(OFFSET(P37,MATCH(\"\"&T37,P37:P$339,0),0):P$339,MATCH(\"*\",OFFSET(P37,MATCH(\"\"&T37,P37:P$339,0),0):P$339,0)),\n0)","v":0},{"$f":"IFERROR(\nINDEX(OFFSET(Q37,MATCH(\"\"&U37,Q37:Q$339,0),0):Q$339,MATCH(\"*\",OFFSET(Q37,MATCH(\"\"&U37,Q37:Q$339,0),0):Q$339,0)),\n0)","v":0}]
[null,null,"Burkina Faso",null,"Agriculture, forestry and fishingCrop and animal production, hunting and related service activitiesRaising of other animals (example dogs & cats)","1.49","Agriculture, forestry and fishing","Crop and animal production, hunting and related service activities","Raising of other animals (example dogs & cats)","Medium","Low","Medium","t114","Not yet drafted",null,{"$f":"IF($G39=Section,\nIF(COUNTIFS(P$22:P38,$H39)=0,$H39,0),\n0)","v":0},{"$f":"IF(AND($G39=Section,$H39=Category),\nIF(COUNTIFS(Q$22:Q38,$I39)=0,$I39,0),\n0)","v":0},null,"Public administration and defence compulsory social security",{"$f":"IFERROR(\nINDEX(OFFSET(P38,MATCH(\"\"&T38,P38:P$339,0),0):P$339,MATCH(\"*\",OFFSET(P38,MATCH(\"\"&T38,P38:P$339,0),0):P$339,0)),\n0)","v":0},{"$f":"IFERROR(\nINDEX(OFFSET(Q38,MATCH(\"\"&U38,Q38:Q$339,0),0):Q$339,MATCH(\"*\",OFFSET(Q38,MATCH(\"\"&U38,Q38:Q$339,0),0):Q$339,0)),\n0)","v":0}]
[null,null,"Burundi",null,"Agriculture, forestry and fishingCrop and animal production, hunting and related service activitiesMixed farming","1.5","Agriculture, forestry and fishing","Crop and animal production, hunting and related service activities","Mixed farming","Medium","High","High","t114","Not yet drafted",null,{"$f":"IF($G40=Section,\nIF(COUNTIFS(P$22:P39,$H40)=0,$H40,0),\n0)","v":0},{"$f":"IF(AND($G40=Section,$H40=Category),\nIF(COUNTIFS(Q$22:Q39,$I40)=0,$I40,0),\n0)","v":0},null,"Real estate activities",{"$f":"IFERROR(\nINDEX(OFFSET(P39,MATCH(\"\"&T39,P39:P$339,0),0):P$339,MATCH(\"*\",OFFSET(P39,MATCH(\"\"&T39,P39:P$339,0),0):P$339,0)),\n0)","v":0},{"$f":"IFERROR(\nINDEX(OFFSET(Q39,MATCH(\"\"&U39,Q39:Q$339,0),0):Q$339,MATCH(\"*\",OFFSET(Q39,MATCH(\"\"&U39,Q39:Q$339,0),0):Q$339,0)),\n0)","v":0}]
[null,null,"Cameroon",null,"Agriculture, forestry and fishingCrop and animal production, hunting and related service activitiesSupport activities for crop production","1.61","Agriculture, forestry and fishing","Crop and animal production, hunting and related service activities","Support activities for crop production","Medium","Medium","Medium","t115","Not yet drafted",null,{"$f":"IF($G41=Section,\nIF(COUNTIFS(P$22:P40,$H41)=0,$H41,0),\n0)","v":0},{"$f":"IF(AND($G41=Section,$H41=Category),\nIF(COUNTIFS(Q$22:Q40,$I41)=0,$I41,0),\n0)","v":0},null,"Transportation and Storage",{"$f":"IFERROR(\nINDEX(OFFSET(P40,MATCH(\"\"&T40,P40:P$339,0),0):P$339,MATCH(\"*\",OFFSET(P40,MATCH(\"\"&T40,P40:P$339,0),0):P$339,0)),\n0)","v":0},{"$f":"IFERROR(\nINDEX(OFFSET(Q40,MATCH(\"\"&U40,Q40:Q$339,0),0):Q$339,MATCH(\"*\",OFFSET(Q40,MATCH(\"\"&U40,Q40:Q$339,0),0):Q$339,0)),\n0)","v":0}]
[null,null,"Cape Verde",null,"Agriculture, forestry and fishingCrop and animal production, hunting and related service activitiesSupport activities for animal production","1.62","Agriculture, forestry and fishing","Crop and animal production, hunting and related service activities","Support activities for animal production","Medium","Medium","Medium","t114","Not yet drafted",null,{"$f":"IF($G42=Section,\nIF(COUNTIFS(P$22:P41,$H42)=0,$H42,0),\n0)","v":0},{"$f":"IF(AND($G42=Section,$H42=Category),\nIF(COUNTIFS(Q$22:Q41,$I42)=0,$I42,0),\n0)","v":0},null,"Water supply (sewerage, waste management and remediation activities)",{"$f":"IFERROR(\nINDEX(OFFSET(P41,MATCH(\"\"&T41,P41:P$339,0),0):P$339,MATCH(\"*\",OFFSET(P41,MATCH(\"\"&T41,P41:P$339,0),0):P$339,0)),\n0)","v":0},{"$f":"IFERROR(\nINDEX(OFFSET(Q41,MATCH(\"\"&U41,Q41:Q$339,0),0):Q$339,MATCH(\"*\",OFFSET(Q41,MATCH(\"\"&U41,Q41:Q$339,0),0):Q$339,0)),\n0)","v":0}]
[null,null,"Central African Republic",null,"Agriculture, forestry and fishingCrop and animal production, hunting and related service activitiesPost-harvest crop activities","1.63","Agriculture, forestry and fishing","Crop and animal production, hunting and related service activities","Post-harvest crop activities","Medium","Medium","Medium","t98","Drafted",null,{"$f":"IF($G43=Section,\nIF(COUNTIFS(P$22:P42,$H43)=0,$H43,0),\n0)","v":0},{"$f":"IF(AND($G43=Section,$H43=Category),\nIF(COUNTIFS(Q$22:Q42,$I43)=0,$I43,0),\n0)","v":0},null,"Wholesale and retail trade",{"$f":"IFERROR(\nINDEX(OFFSET(P42,MATCH(\"\"&T42,P42:P$339,0),0):P$339,MATCH(\"*\",OFFSET(P42,MATCH(\"\"&T42,P42:P$339,0),0):P$339,0)),\n0)","v":0},{"$f":"IFERROR(\nINDEX(OFFSET(Q42,MATCH(\"\"&U42,Q42:Q$339,0),0):Q$339,MATCH(\"*\",OFFSET(Q42,MATCH(\"\"&U42,Q42:Q$339,0),0):Q$339,0)),\n0)","v":0}]
[null,null,"Chad",null,"Agriculture, forestry and fishingCrop and animal production, hunting and related service activitiesSeed process and propagation","1.64","Agriculture, forestry and fishing","Crop and animal production, hunting and related service activities","Seed process and propagation","Medium","Medium","Medium","t115","Not yet drafted",null,{"$f":"IF($G44=Section,\nIF(COUNTIFS(P$22:P43,$H44)=0,$H44,0),\n0)","v":0},{"$f":"IF(AND($G44=Section,$H44=Category),\nIF(COUNTIFS(Q$22:Q43,$I44)=0,$I44,0),\n0)","v":0},null,null,{"$f":"IFERROR(\nINDEX(OFFSET(P43,MATCH(\"\"&T43,P43:P$339,0),0):P$339,MATCH(\"*\",OFFSET(P43,MATCH(\"\"&T43,P43:P$339,0),0):P$339,0)),\n0)","v":0},{"$f":"IFERROR(\nINDEX(OFFSET(Q43,MATCH(\"\"&U43,Q43:Q$339,0),0):Q$339,MATCH(\"*\",OFFSET(Q43,MATCH(\"\"&U43,Q43:Q$339,0),0):Q$339,0)),\n0)","v":0}]
[null,null,"Comoros",null,"Agriculture, forestry and fishingCrop and animal production, hunting and related service activitiesHunting, trapping and related service activities","1.7","Agriculture, forestry and fishing","Crop and animal production, hunting and related service activities","Hunting, trapping and related service activities","High","Medium","High","t64","Not yet drafted",null,{"$f":"IF($G45=Section,\nIF(COUNTIFS(P$22:P44,$H45)=0,$H45,0),\n0)","v":0},{"$f":"IF(AND($G45=Section,$H45=Category),\nIF(COUNTIFS(Q$22:Q44,$I45)=0,$I45,0),\n0)","v":0},null,null,{"$f":"IFERROR(\nINDEX(OFFSET(P44,MATCH(\"\"&T44,P44:P$339,0),0):P$339,MATCH(\"*\",OFFSET(P44,MATCH(\"\"&T44,P44:P$339,0),0):P$339,0)),\n0)","v":0},{"$f":"IFERROR(\nINDEX(OFFSET(Q44,MATCH(\"\"&U44,Q44:Q$339,0),0):Q$339,MATCH(\"*\",OFFSET(Q44,MATCH(\"\"&U44,Q44:Q$339,0),0):Q$339,0)),\n0)","v":0}]
[null,null,"Congo, Democratic Republic of the",null,"Agriculture, forestry and fishingForestry and loggingSilviculture and other forestry activities","2.1","Agriculture, forestry and fishing","Forestry and logging","Silviculture and other forestry activities","High","High","High","t129","Not yet drafted",null,{"$f":"IF($G46=Section,\nIF(COUNTIFS(P$22:P45,$H46)=0,$H46,0),\n0)","v":0},{"$f":"IF(AND($G46=Section,$H46=Category),\nIF(COUNTIFS(Q$22:Q45,$I46)=0,$I46,0),\n0)","v":0},null,null,{"$f":"IFERROR(\nINDEX(OFFSET(P45,MATCH(\"\"&T45,P45:P$339,0),0):P$339,MATCH(\"*\",OFFSET(P45,MATCH(\"\"&T45,P45:P$339,0),0):P$339,0)),\n0)","v":0},{"$f":"IFERROR(\nINDEX(OFFSET(Q45,MATCH(\"\"&U45,Q45:Q$339,0),0):Q$339,MATCH(\"*\",OFFSET(Q45,MATCH(\"\"&U45,Q45:Q$339,0),0):Q$339,0)),\n0)","v":0}]
[null,null,"Congo, Republic of the",null,"Agriculture, forestry and fishingForestry and loggingLogging","2.2","Agriculture, forestry and fishing","Forestry and logging","Logging","High","High","High","t129","Not yet drafted",null,{"$f":"IF($G47=Section,\nIF(COUNTIFS(P$22:P46,$H47)=0,$H47,0),\n0)","v":0},{"$f":"IF(AND($G47=Section,$H47=Category),\nIF(COUNTIFS(Q$22:Q46,$I47)=0,$I47,0),\n0)","v":0},null,null,{"$f":"IFERROR(\nINDEX(OFFSET(P46,MATCH(\"\"&T46,P46:P$339,0),0):P$339,MATCH(\"*\",OFFSET(P46,MATCH(\"\"&T46,P46:P$339,0),0):P$339,0)),\n0)","v":0},{"$f":"IFERROR(\nINDEX(OFFSET(Q46,MATCH(\"\"&U46,Q46:Q$339,0),0):Q$339,MATCH(\"*\",OFFSET(Q46,MATCH(\"\"&U46,Q46:Q$339,0),0):Q$339,0)),\n0)","v":0}]
[null,null,"Cote d'Ivoire",null,"Agriculture, forestry and fishingForestry and loggingGathering of wild growing non-wood products","2.3","Agriculture, forestry and fishing","Forestry and logging","Gathering of wild growing non-wood products","Medium","Medium","Medium","t13","Not yet drafted",null,{"$f":"IF($G48=Section,\nIF(COUNTIFS(P$22:P47,$H48)=0,$H48,0),\n0)","v":0},{"$f":"IF(AND($G48=Section,$H48=Category),\nIF(COUNTIFS(Q$22:Q47,$I48)=0,$I48,0),\n0)","v":0},null,null,{"$f":"IFERROR(\nINDEX(OFFSET(P47,MATCH(\"\"&T47,P47:P$339,0),0):P$339,MATCH(\"*\",OFFSET(P47,MATCH(\"\"&T47,P47:P$339,0),0):P$339,0)),\n0)","v":0},{"$f":"IFERROR(\nINDEX(OFFSET(Q47,MATCH(\"\"&U47,Q47:Q$339,0),0):Q$339,MATCH(\"*\",OFFSET(Q47,MATCH(\"\"&U47,Q47:Q$339,0),0):Q$339,0)),\n0)","v":0}]
[null,null,"Croatia",null,"Agriculture, forestry and fishingForestry and loggingSupport services to forestry","2.4","Agriculture, forestry and fishing","Forestry and logging","Support services to forestry","Medium","Medium","Medium","t129","Not yet drafted",null,{"$f":"IF($G49=Section,\nIF(COUNTIFS(P$22:P48,$H49)=0,$H49,0),\n0)","v":0},{"$f":"IF(AND($G49=Section,$H49=Category),\nIF(COUNTIFS(Q$22:Q48,$I49)=0,$I49,0),\n0)","v":0},null,null,{"$f":"IFERROR(\nINDEX(OFFSET(P48,MATCH(\"\"&T48,P48:P$339,0),0):P$339,MATCH(\"*\",OFFSET(P48,MATCH(\"\"&T48,P48:P$339,0),0):P$339,0)),\n0)","v":0},{"$f":"IFERROR(\nINDEX(OFFSET(Q48,MATCH(\"\"&U48,Q48:Q$339,0),0):Q$339,MATCH(\"*\",OFFSET(Q48,MATCH(\"\"&U48,Q48:Q$339,0),0):Q$339,0)),\n0)","v":0}]
[null,null,"Cyprus",null,"Agriculture, forestry and fishingFishing and aquacultureMarine Fishing","3.11","Agriculture, forestry and fishing","Fishing and aquaculture","Marine Fishing","High","High","High","t118","Not yet drafted",null,{"$f":"IF($G50=Section,\nIF(COUNTIFS(P$22:P49,$H50)=0,$H50,0),\n0)","v":0},{"$f":"IF(AND($G50=Section,$H50=Category),\nIF(COUNTIFS(Q$22:Q49,$I50)=0,$I50,0),\n0)","v":0},null,null,{"$f":"IFERROR(\nINDEX(OFFSET(P49,MATCH(\"\"&T49,P49:P$339,0),0):P$339,MATCH(\"*\",OFFSET(P49,MATCH(\"\"&T49,P49:P$339,0),0):P$339,0)),\n0)","v":0},{"$f":"IFERROR(\nINDEX(OFFSET(Q49,MATCH(\"\"&U49,Q49:Q$339,0),0):Q$339,MATCH(\"*\",OFFSET(Q49,MATCH(\"\"&U49,Q49:Q$339,0),0):Q$339,0)),\n0)","v":0}]
[null,null,"Czech Republic",null,"Agriculture, forestry and fishingFishing and aquacultureFreshwater Fishing","3.12","Agriculture, forestry and fishing","Fishing and aquaculture","Freshwater Fishing","High","Medium","High","t118","Not yet drafted",null,{"$f":"IF($G51=Section,\nIF(COUNTIFS(P$22:P50,$H51)=0,$H51,0),\n0)","v":0},{"$f":"IF(AND($G51=Section,$H51=Category),\nIF(COUNTIFS(Q$22:Q50,$I51)=0,$I51,0),\n0)","v":0},null,null,{"$f":"IFERROR(\nINDEX(OFFSET(P50,MATCH(\"\"&T50,P50:P$339,0),0):P$339,MATCH(\"*\",OFFSET(P50,MATCH(\"\"&T50,P50:P$339,0),0):P$339,0)),\n0)","v":0},{"$f":"IFERROR(\nINDEX(OFFSET(Q50,MATCH(\"\"&U50,Q50:Q$339,0),0):Q$339,MATCH(\"*\",OFFSET(Q50,MATCH(\"\"&U50,Q50:Q$339,0),0):Q$339,0)),\n0)","v":0}]
[null,null,"Denmark",null,"Agriculture, forestry and fishingFishing and aquacultureMarine Aquaculture","3.21","Agriculture, forestry and fishing","Fishing and aquaculture","Marine Aquaculture","High","Medium","High","t112","Not yet drafted",null,{"$f":"IF($G52=Section,\nIF(COUNTIFS(P$22:P51,$H52)=0,$H52,0),\n0)","v":0},{"$f":"IF(AND($G52=Section,$H52=Category),\nIF(COUNTIFS(Q$22:Q51,$I52)=0,$I52,0),\n0)","v":0},null,null,{"$f":"IFERROR(\nINDEX(OFFSET(P51,MATCH(\"\"&T51,P51:P$339,0),0):P$339,MATCH(\"*\",OFFSET(P51,MATCH(\"\"&T51,P51:P$339,0),0):P$339,0)),\n0)","v":0},{"$f":"IFERROR(\nINDEX(OFFSET(Q51,MATCH(\"\"&U51,Q51:Q$339,0),0):Q$339,MATCH(\"*\",OFFSET(Q51,MATCH(\"\"&U51,Q51:Q$339,0),0):Q$339,0)),\n0)","v":0}]
[null,null,"Dhekelia",null,"Agriculture, forestry and fishingFishing and aquacultureFreshwater aquaculture","3.22","Agriculture, forestry and fishing","Fishing and aquaculture","Freshwater aquaculture","High","Medium","High","t112","Not yet drafted",null,{"$f":"IF($G53=Section,\nIF(COUNTIFS(P$22:P52,$H53)=0,$H53,0),\n0)","v":0},{"$f":"IF(AND($G53=Section,$H53=Category),\nIF(COUNTIFS(Q$22:Q52,$I53)=0,$I53,0),\n0)","v":0},null,null,{"$f":"IFERROR(\nINDEX(OFFSET(P52,MATCH(\"\"&T52,P52:P$339,0),0):P$339,MATCH(\"*\",OFFSET(P52,MATCH(\"\"&T52,P52:P$339,0),0):P$339,0)),\n0)","v":0},{"$f":"IFERROR(\nINDEX(OFFSET(Q52,MATCH(\"\"&U52,Q52:Q$339,0),0):Q$339,MATCH(\"*\",OFFSET(Q52,MATCH(\"\"&U52,Q52:Q$339,0),0):Q$339,0)),\n0)","v":0}]
[null,null,"Djibouti",null,"Mining and quarryingMining of coal and ligniteMining of hard coal","5.1","Mining and quarrying","Mining of coal and lignite","Mining of hard coal","High","High","High","t120","Not yet drafted",null,{"$f":"IF($G54=Section,\nIF(COUNTIFS(P$22:P53,$H54)=0,$H54,0),\n0)","v":0},{"$f":"IF(AND($G54=Section,$H54=Category),\nIF(COUNTIFS(Q$22:Q53,$I54)=0,$I54,0),\n0)","v":0},null,null,{"$f":"IFERROR(\nINDEX(OFFSET(P53,MATCH(\"\"&T53,P53:P$339,0),0):P$339,MATCH(\"*\",OFFSET(P53,MATCH(\"\"&T53,P53:P$339,0),0):P$339,0)),\n0)","v":0},{"$f":"IFERROR(\nINDEX(OFFSET(Q53,MATCH(\"\"&U53,Q53:Q$339,0),0):Q$339,MATCH(\"*\",OFFSET(Q53,MATCH(\"\"&U53,Q53:Q$339,0),0):Q$339,0)),\n0)","v":0}]
[null,null,"Egypt",null,"Mining and quarryingMining of coal and ligniteMining of lignite","5.2","Mining and quarrying","Mining of coal and lignite","Mining of lignite","High","High","High","t120","Not yet drafted",null,{"$f":"IF($G55=Section,\nIF(COUNTIFS(P$22:P54,$H55)=0,$H55,0),\n0)","v":0},{"$f":"IF(AND($G55=Section,$H55=Category),\nIF(COUNTIFS(Q$22:Q54,$I55)=0,$I55,0),\n0)","v":0},null,null,{"$f":"IFERROR(\nINDEX(OFFSET(P54,MATCH(\"\"&T54,P54:P$339,0),0):P$339,MATCH(\"*\",OFFSET(P54,MATCH(\"\"&T54,P54:P$339,0),0):P$339,0)),\n0)","v":0},{"$f":"IFERROR(\nINDEX(OFFSET(Q54,MATCH(\"\"&U54,Q54:Q$339,0),0):Q$339,MATCH(\"*\",OFFSET(Q54,MATCH(\"\"&U54,Q54:Q$339,0),0):Q$339,0)),\n0)","v":0}]
[null,null,"Equatorial Guinea",null,"Mining and quarryingExtraction of crude petroleum and natural gasExtraction of crude petroleum","6.1","Mining and quarrying","Extraction of crude petroleum and natural gas","Extraction of crude petroleum","High","High","High","t43","Not yet drafted",null,{"$f":"IF($G56=Section,\nIF(COUNTIFS(P$22:P55,$H56)=0,$H56,0),\n0)","v":0},{"$f":"IF(AND($G56=Section,$H56=Category),\nIF(COUNTIFS(Q$22:Q55,$I56)=0,$I56,0),\n0)","v":0},null,null,{"$f":"IFERROR(\nINDEX(OFFSET(P55,MATCH(\"\"&T55,P55:P$339,0),0):P$339,MATCH(\"*\",OFFSET(P55,MATCH(\"\"&T55,P55:P$339,0),0):P$339,0)),\n0)","v":0},{"$f":"IFERROR(\nINDEX(OFFSET(Q55,MATCH(\"\"&U55,Q55:Q$339,0),0):Q$339,MATCH(\"*\",OFFSET(Q55,MATCH(\"\"&U55,Q55:Q$339,0),0):Q$339,0)),\n0)","v":0}]
[null,null,"Eritrea",null,"Mining and quarryingExtraction of crude petroleum and natural gasExtraction of natural gas","6.2","Mining and quarrying","Extraction of crude petroleum and natural gas","Extraction of natural gas","High","High","High","t44","Not yet drafted",null,{"$f":"IF($G57=Section,\nIF(COUNTIFS(P$22:P56,$H57)=0,$H57,0),\n0)","v":0},{"$f":"IF(AND($G57=Section,$H57=Category),\nIF(COUNTIFS(Q$22:Q56,$I57)=0,$I57,0),\n0)","v":0},null,null,{"$f":"IFERROR(\nINDEX(OFFSET(P56,MATCH(\"\"&T56,P56:P$339,0),0):P$339,MATCH(\"*\",OFFSET(P56,MATCH(\"\"&T56,P56:P$339,0),0):P$339,0)),\n0)","v":0},{"$f":"IFERROR(\nINDEX(OFFSET(Q56,MATCH(\"\"&U56,Q56:Q$339,0),0):Q$339,MATCH(\"*\",OFFSET(Q56,MATCH(\"\"&U56,Q56:Q$339,0),0):Q$339,0)),\n0)","v":0}]
[null,null,"Estonia",null,"Mining and quarryingMining of metal oresMining of iron ores","7.1","Mining and quarrying","Mining of metal ores","Mining of iron ores","High","High","High","t120","Not yet drafted",null,{"$f":"IF($G58=Section,\nIF(COUNTIFS(P$22:P57,$H58)=0,$H58,0),\n0)","v":0},{"$f":"IF(AND($G58=Section,$H58=Category),\nIF(COUNTIFS(Q$22:Q57,$I58)=0,$I58,0),\n0)","v":0},null,null,{"$f":"IFERROR(\nINDEX(OFFSET(P57,MATCH(\"\"&T57,P57:P$339,0),0):P$339,MATCH(\"*\",OFFSET(P57,MATCH(\"\"&T57,P57:P$339,0),0):P$339,0)),\n0)","v":0},{"$f":"IFERROR(\nINDEX(OFFSET(Q57,MATCH(\"\"&U57,Q57:Q$339,0),0):Q$339,MATCH(\"*\",OFFSET(Q57,MATCH(\"\"&U57,Q57:Q$339,0),0):Q$339,0)),\n0)","v":0}]
[null,null,"Ethiopia",null,"Mining and quarryingMining of metal oresMining of uranium and thorium ores","7.21","Mining and quarrying","Mining of metal ores","Mining of uranium and thorium ores","High","High","High","t120","Not yet drafted",null,{"$f":"IF($G59=Section,\nIF(COUNTIFS(P$22:P58,$H59)=0,$H59,0),\n0)","v":0},{"$f":"IF(AND($G59=Section,$H59=Category),\nIF(COUNTIFS(Q$22:Q58,$I59)=0,$I59,0),\n0)","v":0},null,null,{"$f":"IFERROR(\nINDEX(OFFSET(P58,MATCH(\"\"&T58,P58:P$339,0),0):P$339,MATCH(\"*\",OFFSET(P58,MATCH(\"\"&T58,P58:P$339,0),0):P$339,0)),\n0)","v":0},{"$f":"IFERROR(\nINDEX(OFFSET(Q58,MATCH(\"\"&U58,Q58:Q$339,0),0):Q$339,MATCH(\"*\",OFFSET(Q58,MATCH(\"\"&U58,Q58:Q$339,0),0):Q$339,0)),\n0)","v":0}]
[null,null,"Europa Island",null,"Mining and quarryingMining of metal oresMining of other non-ferrous metal ores","7.29","Mining and quarrying","Mining of metal ores","Mining of other non-ferrous metal ores","High","High","High","t120","Not yet drafted",null,{"$f":"IF($G60=Section,\nIF(COUNTIFS(P$22:P59,$H60)=0,$H60,0),\n0)","v":0},{"$f":"IF(AND($G60=Section,$H60=Category),\nIF(COUNTIFS(Q$22:Q59,$I60)=0,$I60,0),\n0)","v":0},null,null,{"$f":"IFERROR(\nINDEX(OFFSET(P59,MATCH(\"\"&T59,P59:P$339,0),0):P$339,MATCH(\"*\",OFFSET(P59,MATCH(\"\"&T59,P59:P$339,0),0):P$339,0)),\n0)","v":0},{"$f":"IFERROR(\nINDEX(OFFSET(Q59,MATCH(\"\"&U59,Q59:Q$339,0),0):Q$339,MATCH(\"*\",OFFSET(Q59,MATCH(\"\"&U59,Q59:Q$339,0),0):Q$339,0)),\n0)","v":0}]
[null,null,"Faroe Islands",null,"Mining and quarryingOther mining and quarryingQuarrying of stone, sand and clay","8.1","Mining and quarrying","Other mining and quarrying","Quarrying of stone, sand and clay","High","High","High","t108","Drafted",null,{"$f":"IF($G61=Section,\nIF(COUNTIFS(P$22:P60,$H61)=0,$H61,0),\n0)","v":0},{"$f":"IF(AND($G61=Section,$H61=Category),\nIF(COUNTIFS(Q$22:Q60,$I61)=0,$I61,0),\n0)","v":0},null,null,{"$f":"IFERROR(\nINDEX(OFFSET(P60,MATCH(\"\"&T60,P60:P$339,0),0):P$339,MATCH(\"*\",OFFSET(P60,MATCH(\"\"&T60,P60:P$339,0),0):P$339,0)),\n0)","v":0},{"$f":"IFERROR(\nINDEX(OFFSET(Q60,MATCH(\"\"&U60,Q60:Q$339,0),0):Q$339,MATCH(\"*\",OFFSET(Q60,MATCH(\"\"&U60,Q60:Q$339,0),0):Q$339,0)),\n0)","v":0}]
[null,null,"Finland",null,"Mining and quarryingOther mining and quarryingQuarrying of ornamental and building stone, limestone, gypsum, chalk and slate","8.11","Mining and quarrying","Other mining and quarrying","Quarrying of ornamental and building stone, limestone, gypsum, chalk and slate","High","High","High","t108","Drafted",null,{"$f":"IF($G62=Section,\nIF(COUNTIFS(P$22:P61,$H62)=0,$H62,0),\n0)","v":0},{"$f":"IF(AND($G62=Section,$H62=Category),\nIF(COUNTIFS(Q$22:Q61,$I62)=0,$I62,0),\n0)","v":0},null,null,{"$f":"IFERROR(\nINDEX(OFFSET(P61,MATCH(\"\"&T61,P61:P$339,0),0):P$339,MATCH(\"*\",OFFSET(P61,MATCH(\"\"&T61,P61:P$339,0),0):P$339,0)),\n0)","v":0},{"$f":"IFERROR(\nINDEX(OFFSET(Q61,MATCH(\"\"&U61,Q61:Q$339,0),0):Q$339,MATCH(\"*\",OFFSET(Q61,MATCH(\"\"&U61,Q61:Q$339,0),0):Q$339,0)),\n0)","v":0}]
[null,null,"France",null,"Mining and quarryingOther mining and quarryingOperation of gravel and sand pits; mining of clays and kaolin","8.12","Mining and quarrying","Other mining and quarrying","Operation of gravel and sand pits; mining of clays and kaolin","High","High","High","t108","Drafted",null,{"$f":"IF($G63=Section,\nIF(COUNTIFS(P$22:P62,$H63)=0,$H63,0),\n0)","v":0},{"$f":"IF(AND($G63=Section,$H63=Category),\nIF(COUNTIFS(Q$22:Q62,$I63)=0,$I63,0),\n0)","v":0},null,null,{"$f":"IFERROR(\nINDEX(OFFSET(P62,MATCH(\"\"&T62,P62:P$339,0),0):P$339,MATCH(\"*\",OFFSET(P62,MATCH(\"\"&T62,P62:P$339,0),0):P$339,0)),\n0)","v":0},{"$f":"IFERROR(\nINDEX(OFFSET(Q62,MATCH(\"\"&U62,Q62:Q$339,0),0):Q$339,MATCH(\"*\",OFFSET(Q62,MATCH(\"\"&U62,Q62:Q$339,0),0):Q$339,0)),\n0)","v":0}]
[null,null,"Gabon",null,"Mining and quarryingOther mining and quarryingMining of chemical and fertiliser minerals","8.91","Mining and quarrying","Other mining and quarrying","Mining of chemical and fertiliser minerals","High","High","High","t120","Not yet drafted",null,{"$f":"IF($G64=Section,\nIF(COUNTIFS(P$22:P63,$H64)=0,$H64,0),\n0)","v":0},{"$f":"IF(AND($G64=Section,$H64=Category),\nIF(COUNTIFS(Q$22:Q63,$I64)=0,$I64,0),\n0)","v":0},null,null,{"$f":"IFERROR(\nINDEX(OFFSET(P63,MATCH(\"\"&T63,P63:P$339,0),0):P$339,MATCH(\"*\",OFFSET(P63,MATCH(\"\"&T63,P63:P$339,0),0):P$339,0)),\n0)","v":0},{"$f":"IFERROR(\nINDEX(OFFSET(Q63,MATCH(\"\"&U63,Q63:Q$339,0),0):Q$339,MATCH(\"*\",OFFSET(Q63,MATCH(\"\"&U63,Q63:Q$339,0),0):Q$339,0)),\n0)","v":0}]
[null,null,"Gambia, The",null,"Mining and quarryingOther mining and quarryingExtraction of peat","8.92","Mining and quarrying","Other mining and quarrying","Extraction of peat","High","High","High","t91","Drafted",null,{"$f":"IF($G65=Section,\nIF(COUNTIFS(P$22:P64,$H65)=0,$H65,0),\n0)","v":0},{"$f":"IF(AND($G65=Section,$H65=Category),\nIF(COUNTIFS(Q$22:Q64,$I65)=0,$I65,0),\n0)","v":0},null,null,{"$f":"IFERROR(\nINDEX(OFFSET(P64,MATCH(\"\"&T64,P64:P$339,0),0):P$339,MATCH(\"*\",OFFSET(P64,MATCH(\"\"&T64,P64:P$339,0),0):P$339,0)),\n0)","v":0},{"$f":"IFERROR(\nINDEX(OFFSET(Q64,MATCH(\"\"&U64,Q64:Q$339,0),0):Q$339,MATCH(\"*\",OFFSET(Q64,MATCH(\"\"&U64,Q64:Q$339,0),0):Q$339,0)),\n0)","v":0}]
[null,null,"Gaza Strip",null,"Mining and quarryingOther mining and quarryingExtraction of salt","8.93","Mining and quarrying","Other mining and quarrying","Extraction of salt","High","High","High","t121","Not yet drafted",null,{"$f":"IF($G66=Section,\nIF(COUNTIFS(P$22:P65,$H66)=0,$H66,0),\n0)","v":0},{"$f":"IF(AND($G66=Section,$H66=Category),\nIF(COUNTIFS(Q$22:Q65,$I66)=0,$I66,0),\n0)","v":0},null,null,{"$f":"IFERROR(\nINDEX(OFFSET(P65,MATCH(\"\"&T65,P65:P$339,0),0):P$339,MATCH(\"*\",OFFSET(P65,MATCH(\"\"&T65,P65:P$339,0),0):P$339,0)),\n0)","v":0},{"$f":"IFERROR(\nINDEX(OFFSET(Q65,MATCH(\"\"&U65,Q65:Q$339,0),0):Q$339,MATCH(\"*\",OFFSET(Q65,MATCH(\"\"&U65,Q65:Q$339,0),0):Q$339,0)),\n0)","v":0}]
[null,null,"Georgia",null,"Mining and quarryingOther mining and quarryingOther mining and quarrying n.e.c. (abrasive materials, asbestos, siliceous fossil meals, natural graphite, natural asphalt, natural solid bitumen)","8.99","Mining and quarrying","Other mining and quarrying","Other mining and quarrying n.e.c. (abrasive materials, asbestos, siliceous fossil meals, natural graphite, natural asphalt, natural solid bitumen)","High","High","High","t120","Not yet drafted",null,{"$f":"IF($G67=Section,\nIF(COUNTIFS(P$22:P66,$H67)=0,$H67,0),\n0)","v":0},{"$f":"IF(AND($G67=Section,$H67=Category),\nIF(COUNTIFS(Q$22:Q66,$I67)=0,$I67,0),\n0)","v":0},null,null,{"$f":"IFERROR(\nINDEX(OFFSET(P66,MATCH(\"\"&T66,P66:P$339,0),0):P$339,MATCH(\"*\",OFFSET(P66,MATCH(\"\"&T66,P66:P$339,0),0):P$339,0)),\n0)","v":0},{"$f":"IFERROR(\nINDEX(OFFSET(Q66,MATCH(\"\"&U66,Q66:Q$339,0),0):Q$339,MATCH(\"*\",OFFSET(Q66,MATCH(\"\"&U66,Q66:Q$339,0),0):Q$339,0)),\n0)","v":0}]
[null,null,"Germany",null,"Mining and quarryingMining support service activitiesSupport activities for petroleum and natural gas extraction","9.1","Mining and quarrying","Mining support service activities","Support activities for petroleum and natural gas extraction","High","High","High","t45","Not yet drafted",null,{"$f":"IF($G68=Section,\nIF(COUNTIFS(P$22:P67,$H68)=0,$H68,0),\n0)","v":0},{"$f":"IF(AND($G68=Section,$H68=Category),\nIF(COUNTIFS(Q$22:Q67,$I68)=0,$I68,0),\n0)","v":0},null,null,{"$f":"IFERROR(\nINDEX(OFFSET(P67,MATCH(\"\"&T67,P67:P$339,0),0):P$339,MATCH(\"*\",OFFSET(P67,MATCH(\"\"&T67,P67:P$339,0),0):P$339,0)),\n0)","v":0},{"$f":"IFERROR(\nINDEX(OFFSET(Q67,MATCH(\"\"&U67,Q67:Q$339,0),0):Q$339,MATCH(\"*\",OFFSET(Q67,MATCH(\"\"&U67,Q67:Q$339,0),0):Q$339,0)),\n0)","v":0}]
[null,null,"Ghana",null,"Mining and quarryingMining support service activitiesSupport for other mining and quarrying, e.g. exploration service, geological observations, draining and pumping services","9.9","Mining and quarrying","Mining support service activities","Support for other mining and quarrying, e.g. exploration service, geological observations, draining and pumping services","High","High","High","t120","Not yet drafted",null,{"$f":"IF($G69=Section,\nIF(COUNTIFS(P$22:P68,$H69)=0,$H69,0),\n0)","v":0},{"$f":"IF(AND($G69=Section,$H69=Category),\nIF(COUNTIFS(Q$22:Q68,$I69)=0,$I69,0),\n0)","v":0},null,null,{"$f":"IFERROR(\nINDEX(OFFSET(P68,MATCH(\"\"&T68,P68:P$339,0),0):P$339,MATCH(\"*\",OFFSET(P68,MATCH(\"\"&T68,P68:P$339,0),0):P$339,0)),\n0)","v":0},{"$f":"IFERROR(\nINDEX(OFFSET(Q68,MATCH(\"\"&U68,Q68:Q$339,0),0):Q$339,MATCH(\"*\",OFFSET(Q68,MATCH(\"\"&U68,Q68:Q$339,0),0):Q$339,0)),\n0)","v":0}]
[null,null,"Gibraltar",null,"ManufacturingManufacture of food productsProcessing and preserving of meat","10.11","Manufacturing","Manufacture of food products","Processing and preserving of meat","Medium","High","Medium","t99","Drafted",null,{"$f":"IF($G70=Section,\nIF(COUNTIFS(P$22:P69,$H70)=0,$H70,0),\n0)","v":0},{"$f":"IF(AND($G70=Section,$H70=Category),\nIF(COUNTIFS(Q$22:Q69,$I70)=0,$I70,0),\n0)","v":0},null,null,{"$f":"IFERROR(\nINDEX(OFFSET(P69,MATCH(\"\"&T69,P69:P$339,0),0):P$339,MATCH(\"*\",OFFSET(P69,MATCH(\"\"&T69,P69:P$339,0),0):P$339,0)),\n0)","v":0},{"$f":"IFERROR(\nINDEX(OFFSET(Q69,MATCH(\"\"&U69,Q69:Q$339,0),0):Q$339,MATCH(\"*\",OFFSET(Q69,MATCH(\"\"&U69,Q69:Q$339,0),0):Q$339,0)),\n0)","v":0}]
[null,null,"Glorioso Islands",null,"ManufacturingManufacture of food productsProcessing and preserving of poultry meat","10.12","Manufacturing","Manufacture of food products","Processing and preserving of poultry meat","Medium","High","Medium","t99","Drafted",null,{"$f":"IF($G71=Section,\nIF(COUNTIFS(P$22:P70,$H71)=0,$H71,0),\n0)","v":0},{"$f":"IF(AND($G71=Section,$H71=Category),\nIF(COUNTIFS(Q$22:Q70,$I71)=0,$I71,0),\n0)","v":0},null,null,{"$f":"IFERROR(\nINDEX(OFFSET(P70,MATCH(\"\"&T70,P70:P$339,0),0):P$339,MATCH(\"*\",OFFSET(P70,MATCH(\"\"&T70,P70:P$339,0),0):P$339,0)),\n0)","v":0},{"$f":"IFERROR(\nINDEX(OFFSET(Q70,MATCH(\"\"&U70,Q70:Q$339,0),0):Q$339,MATCH(\"*\",OFFSET(Q70,MATCH(\"\"&U70,Q70:Q$339,0),0):Q$339,0)),\n0)","v":0}]
[null,null,"Greece",null,"ManufacturingManufacture of food productsProduction of meat and poultry meat products","10.13","Manufacturing","Manufacture of food products","Production of meat and poultry meat products","Medium","High","Medium","t99","Drafted",null,{"$f":"IF($G72=Section,\nIF(COUNTIFS(P$22:P71,$H72)=0,$H72,0),\n0)","v":0},{"$f":"IF(AND($G72=Section,$H72=Category),\nIF(COUNTIFS(Q$22:Q71,$I72)=0,$I72,0),\n0)","v":0},null,null,{"$f":"IFERROR(\nINDEX(OFFSET(P71,MATCH(\"\"&T71,P71:P$339,0),0):P$339,MATCH(\"*\",OFFSET(P71,MATCH(\"\"&T71,P71:P$339,0),0):P$339,0)),\n0)","v":0},{"$f":"IFERROR(\nINDEX(OFFSET(Q71,MATCH(\"\"&U71,Q71:Q$339,0),0):Q$339,MATCH(\"*\",OFFSET(Q71,MATCH(\"\"&U71,Q71:Q$339,0),0):Q$339,0)),\n0)","v":0}]
[null,null,"Guernsey",null,"ManufacturingManufacture of food productsProcessing and preserving of fish, crustaceans and molluscs","10.2","Manufacturing","Manufacture of food products","Processing and preserving of fish, crustaceans and molluscs","Medium","Medium","Medium","t97","Drafted",null,{"$f":"IF($G73=Section,\nIF(COUNTIFS(P$22:P72,$H73)=0,$H73,0),\n0)","v":0},{"$f":"IF(AND($G73=Section,$H73=Category),\nIF(COUNTIFS(Q$22:Q72,$I73)=0,$I73,0),\n0)","v":0},null,null,{"$f":"IFERROR(\nINDEX(OFFSET(P72,MATCH(\"\"&T72,P72:P$339,0),0):P$339,MATCH(\"*\",OFFSET(P72,MATCH(\"\"&T72,P72:P$339,0),0):P$339,0)),\n0)","v":0},{"$f":"IFERROR(\nINDEX(OFFSET(Q72,MATCH(\"\"&U72,Q72:Q$339,0),0):Q$339,MATCH(\"*\",OFFSET(Q72,MATCH(\"\"&U72,Q72:Q$339,0),0):Q$339,0)),\n0)","v":0}]
[null,null,"Guinea",null,"ManufacturingManufacture of food productsProcessing and preserving of potatoes","10.31","Manufacturing","Manufacture of food products","Processing and preserving of potatoes","Medium","Medium","Medium","t98","Drafted",null,{"$f":"IF($G74=Section,\nIF(COUNTIFS(P$22:P73,$H74)=0,$H74,0),\n0)","v":0},{"$f":"IF(AND($G74=Section,$H74=Category),\nIF(COUNTIFS(Q$22:Q73,$I74)=0,$I74,0),\n0)","v":0},null,null,{"$f":"IFERROR(\nINDEX(OFFSET(P73,MATCH(\"\"&T73,P73:P$339,0),0):P$339,MATCH(\"*\",OFFSET(P73,MATCH(\"\"&T73,P73:P$339,0),0):P$339,0)),\n0)","v":0},{"$f":"IFERROR(\nINDEX(OFFSET(Q73,MATCH(\"\"&U73,Q73:Q$339,0),0):Q$339,MATCH(\"*\",OFFSET(Q73,MATCH(\"\"&U73,Q73:Q$339,0),0):Q$339,0)),\n0)","v":0}]
[null,null,"Guinea-Bissau",null,"ManufacturingManufacture of food productsManufacture of fruit and vegetable juice","10.32","Manufacturing","Manufacture of food products","Manufacture of fruit and vegetable juice","Medium","Medium","Medium","t119","Drafted",null,{"$f":"IF($G75=Section,\nIF(COUNTIFS(P$22:P74,$H75)=0,$H75,0),\n0)","v":0},{"$f":"IF(AND($G75=Section,$H75=Category),\nIF(COUNTIFS(Q$22:Q74,$I75)=0,$I75,0),\n0)","v":0},null,null,{"$f":"IFERROR(\nINDEX(OFFSET(P74,MATCH(\"\"&T74,P74:P$339,0),0):P$339,MATCH(\"*\",OFFSET(P74,MATCH(\"\"&T74,P74:P$339,0),0):P$339,0)),\n0)","v":0},{"$f":"IFERROR(\nINDEX(OFFSET(Q74,MATCH(\"\"&U74,Q74:Q$339,0),0):Q$339,MATCH(\"*\",OFFSET(Q74,MATCH(\"\"&U74,Q74:Q$339,0),0):Q$339,0)),\n0)","v":0}]
[null,null,"Holy See (Vatican City)",null,"ManufacturingManufacture of food productsOther processing and preserving of fruit and vegetables","10.39","Manufacturing","Manufacture of food products","Other processing and preserving of fruit and vegetables","Medium","Medium","Medium","t98","Drafted",null,{"$f":"IF($G76=Section,\nIF(COUNTIFS(P$22:P75,$H76)=0,$H76,0),\n0)","v":0},{"$f":"IF(AND($G76=Section,$H76=Category),\nIF(COUNTIFS(Q$22:Q75,$I76)=0,$I76,0),\n0)","v":0},null,null,{"$f":"IFERROR(\nINDEX(OFFSET(P75,MATCH(\"\"&T75,P75:P$339,0),0):P$339,MATCH(\"*\",OFFSET(P75,MATCH(\"\"&T75,P75:P$339,0),0):P$339,0)),\n0)","v":0},{"$f":"IFERROR(\nINDEX(OFFSET(Q75,MATCH(\"\"&U75,Q75:Q$339,0),0):Q$339,MATCH(\"*\",OFFSET(Q75,MATCH(\"\"&U75,Q75:Q$339,0),0):Q$339,0)),\n0)","v":0}]
[null,null,"Hungary",null,"ManufacturingManufacture of food productsManufacture of oils and fats","10.41","Manufacturing","Manufacture of food products","Manufacture of oils and fats","Medium","Medium","Medium","t96","Drafted",null,{"$f":"IF($G77=Section,\nIF(COUNTIFS(P$22:P76,$H77)=0,$H77,0),\n0)","v":0},{"$f":"IF(AND($G77=Section,$H77=Category),\nIF(COUNTIFS(Q$22:Q76,$I77)=0,$I77,0),\n0)","v":0},null,null,{"$f":"IFERROR(\nINDEX(OFFSET(P76,MATCH(\"\"&T76,P76:P$339,0),0):P$339,MATCH(\"*\",OFFSET(P76,MATCH(\"\"&T76,P76:P$339,0),0):P$339,0)),\n0)","v":0},{"$f":"IFERROR(\nINDEX(OFFSET(Q76,MATCH(\"\"&U76,Q76:Q$339,0),0):Q$339,MATCH(\"*\",OFFSET(Q76,MATCH(\"\"&U76,Q76:Q$339,0),0):Q$339,0)),\n0)","v":0}]
[null,null,"Iceland",null,"ManufacturingManufacture of food productsManufacture of margarine and similar edible fats","10.42","Manufacturing","Manufacture of food products","Manufacture of margarine and similar edible fats","Medium","Medium","Medium","t96","Drafted",null,{"$f":"IF($G78=Section,\nIF(COUNTIFS(P$22:P77,$H78)=0,$H78,0),\n0)","v":0},{"$f":"IF(AND($G78=Section,$H78=Category),\nIF(COUNTIFS(Q$22:Q77,$I78)=0,$I78,0),\n0)","v":0},null,null,{"$f":"IFERROR(\nINDEX(OFFSET(P77,MATCH(\"\"&T77,P77:P$339,0),0):P$339,MATCH(\"*\",OFFSET(P77,MATCH(\"\"&T77,P77:P$339,0),0):P$339,0)),\n0)","v":0},{"$f":"IFERROR(\nINDEX(OFFSET(Q77,MATCH(\"\"&U77,Q77:Q$339,0),0):Q$339,MATCH(\"*\",OFFSET(Q77,MATCH(\"\"&U77,Q77:Q$339,0),0):Q$339,0)),\n0)","v":0}]
[null,null,"Iran",null,"ManufacturingManufacture of food productsOperation of dairies and cheese making","10.51","Manufacturing","Manufacture of food products","Operation of dairies and cheese making","Medium","Medium","Medium","t96","Drafted",null,{"$f":"IF($G79=Section,\nIF(COUNTIFS(P$22:P78,$H79)=0,$H79,0),\n0)","v":0},{"$f":"IF(AND($G79=Section,$H79=Category),\nIF(COUNTIFS(Q$22:Q78,$I79)=0,$I79,0),\n0)","v":0},null,null,{"$f":"IFERROR(\nINDEX(OFFSET(P78,MATCH(\"\"&T78,P78:P$339,0),0):P$339,MATCH(\"*\",OFFSET(P78,MATCH(\"\"&T78,P78:P$339,0),0):P$339,0)),\n0)","v":0},{"$f":"IFERROR(\nINDEX(OFFSET(Q78,MATCH(\"\"&U78,Q78:Q$339,0),0):Q$339,MATCH(\"*\",OFFSET(Q78,MATCH(\"\"&U78,Q78:Q$339,0),0):Q$339,0)),\n0)","v":0}]
[null,null,"Iraq",null,"ManufacturingManufacture of food productsManufacture of ice cream","10.52","Manufacturing","Manufacture of food products","Manufacture of ice cream","Medium","Medium","Medium","t96","Drafted",null,{"$f":"IF($G80=Section,\nIF(COUNTIFS(P$22:P79,$H80)=0,$H80,0),\n0)","v":0},{"$f":"IF(AND($G80=Section,$H80=Category),\nIF(COUNTIFS(Q$22:Q79,$I80)=0,$I80,0),\n0)","v":0},null,null,{"$f":"IFERROR(\nINDEX(OFFSET(P79,MATCH(\"\"&T79,P79:P$339,0),0):P$339,MATCH(\"*\",OFFSET(P79,MATCH(\"\"&T79,P79:P$339,0),0):P$339,0)),\n0)","v":0},{"$f":"IFERROR(\nINDEX(OFFSET(Q79,MATCH(\"\"&U79,Q79:Q$339,0),0):Q$339,MATCH(\"*\",OFFSET(Q79,MATCH(\"\"&U79,Q79:Q$339,0),0):Q$339,0)),\n0)","v":0}]
[null,null,"Ireland",null,"ManufacturingManufacture of food productsManufacture of grain mill products, starches and starch products","10.6","Manufacturing","Manufacture of food products","Manufacture of grain mill products, starches and starch products","Medium","Medium","Medium","t95","Drafted",null,{"$f":"IF($G81=Section,\nIF(COUNTIFS(P$22:P80,$H81)=0,$H81,0),\n0)","v":0},{"$f":"IF(AND($G81=Section,$H81=Category),\nIF(COUNTIFS(Q$22:Q80,$I81)=0,$I81,0),\n0)","v":0},null,null,{"$f":"IFERROR(\nINDEX(OFFSET(P80,MATCH(\"\"&T80,P80:P$339,0),0):P$339,MATCH(\"*\",OFFSET(P80,MATCH(\"\"&T80,P80:P$339,0),0):P$339,0)),\n0)","v":0},{"$f":"IFERROR(\nINDEX(OFFSET(Q80,MATCH(\"\"&U80,Q80:Q$339,0),0):Q$339,MATCH(\"*\",OFFSET(Q80,MATCH(\"\"&U80,Q80:Q$339,0),0):Q$339,0)),\n0)","v":0}]
[null,null,"Isle of Man",null,"ManufacturingManufacture of food productsManufacture of bread, manufacture of fresh pastry goods and cakes","10.71","Manufacturing","Manufacture of food products","Manufacture of bread, manufacture of fresh pastry goods and cakes","Medium","Medium","Medium","t93","Drafted",null,{"$f":"IF($G82=Section,\nIF(COUNTIFS(P$22:P81,$H82)=0,$H82,0),\n0)","v":0},{"$f":"IF(AND($G82=Section,$H82=Category),\nIF(COUNTIFS(Q$22:Q81,$I82)=0,$I82,0),\n0)","v":0},null,null,{"$f":"IFERROR(\nINDEX(OFFSET(P81,MATCH(\"\"&T81,P81:P$339,0),0):P$339,MATCH(\"*\",OFFSET(P81,MATCH(\"\"&T81,P81:P$339,0),0):P$339,0)),\n0)","v":0},{"$f":"IFERROR(\nINDEX(OFFSET(Q81,MATCH(\"\"&U81,Q81:Q$339,0),0):Q$339,MATCH(\"*\",OFFSET(Q81,MATCH(\"\"&U81,Q81:Q$339,0),0):Q$339,0)),\n0)","v":0}]
[null,null,"Israel",null,"ManufacturingManufacture of food productsManufacture of rusks and biscuits; manufacture of preserved pastry goods and cakes","10.72","Manufacturing","Manufacture of food products","Manufacture of rusks and biscuits; manufacture of preserved pastry goods and cakes","Medium","Medium","Medium","t93","Drafted",null,{"$f":"IF($G83=Section,\nIF(COUNTIFS(P$22:P82,$H83)=0,$H83,0),\n0)","v":0},{"$f":"IF(AND($G83=Section,$H83=Category),\nIF(COUNTIFS(Q$22:Q82,$I83)=0,$I83,0),\n0)","v":0},null,null,{"$f":"IFERROR(\nINDEX(OFFSET(P82,MATCH(\"\"&T82,P82:P$339,0),0):P$339,MATCH(\"*\",OFFSET(P82,MATCH(\"\"&T82,P82:P$339,0),0):P$339,0)),\n0)","v":0},{"$f":"IFERROR(\nINDEX(OFFSET(Q82,MATCH(\"\"&U82,Q82:Q$339,0),0):Q$339,MATCH(\"*\",OFFSET(Q82,MATCH(\"\"&U82,Q82:Q$339,0),0):Q$339,0)),\n0)","v":0}]
[null,null,"Italy",null,"ManufacturingManufacture of food productsManufacture of macaroni, noodles, couscous and similar farinaceous products","10.73","Manufacturing","Manufacture of food products","Manufacture of macaroni, noodles, couscous and similar farinaceous products","Medium","Medium","Medium","t93","Drafted",null,{"$f":"IF($G84=Section,\nIF(COUNTIFS(P$22:P83,$H84)=0,$H84,0),\n0)","v":0},{"$f":"IF(AND($G84=Section,$H84=Category),\nIF(COUNTIFS(Q$22:Q83,$I84)=0,$I84,0),\n0)","v":0},null,null,{"$f":"IFERROR(\nINDEX(OFFSET(P83,MATCH(\"\"&T83,P83:P$339,0),0):P$339,MATCH(\"*\",OFFSET(P83,MATCH(\"\"&T83,P83:P$339,0),0):P$339,0)),\n0)","v":0},{"$f":"IFERROR(\nINDEX(OFFSET(Q83,MATCH(\"\"&U83,Q83:Q$339,0),0):Q$339,MATCH(\"*\",OFFSET(Q83,MATCH(\"\"&U83,Q83:Q$339,0),0):Q$339,0)),\n0)","v":0}]
[null,null,"Jan Mayen",null,"ManufacturingManufacture of food productsManufacture of other food products (e.g. sugar confectionery, tea and coffee, condiments and seasoning, prepared meals, etc.)","10.8","Manufacturing","Manufacture of food products","Manufacture of other food products (e.g. sugar confectionery, tea and coffee, condiments and seasoning, prepared meals, etc.)","Medium","Medium","Medium","t20","Not yet drafted",null,{"$f":"IF($G85=Section,\nIF(COUNTIFS(P$22:P84,$H85)=0,$H85,0),\n0)","v":0},{"$f":"IF(AND($G85=Section,$H85=Category),\nIF(COUNTIFS(Q$22:Q84,$I85)=0,$I85,0),\n0)","v":0},null,null,{"$f":"IFERROR(\nINDEX(OFFSET(P84,MATCH(\"\"&T84,P84:P$339,0),0):P$339,MATCH(\"*\",OFFSET(P84,MATCH(\"\"&T84,P84:P$339,0),0):P$339,0)),\n0)","v":0},{"$f":"IFERROR(\nINDEX(OFFSET(Q84,MATCH(\"\"&U84,Q84:Q$339,0),0):Q$339,MATCH(\"*\",OFFSET(Q84,MATCH(\"\"&U84,Q84:Q$339,0),0):Q$339,0)),\n0)","v":0}]
[null,null,"Jersey",null,"ManufacturingManufacture of food productsManufacture of prepared feeds for farm animals","10.91","Manufacturing","Manufacture of food products","Manufacture of prepared feeds for farm animals","Medium","Medium","Medium","t111","Not yet drafted",null,{"$f":"IF($G86=Section,\nIF(COUNTIFS(P$22:P85,$H86)=0,$H86,0),\n0)","v":0},{"$f":"IF(AND($G86=Section,$H86=Category),\nIF(COUNTIFS(Q$22:Q85,$I86)=0,$I86,0),\n0)","v":0},null,null,{"$f":"IFERROR(\nINDEX(OFFSET(P85,MATCH(\"\"&T85,P85:P$339,0),0):P$339,MATCH(\"*\",OFFSET(P85,MATCH(\"\"&T85,P85:P$339,0),0):P$339,0)),\n0)","v":0},{"$f":"IFERROR(\nINDEX(OFFSET(Q85,MATCH(\"\"&U85,Q85:Q$339,0),0):Q$339,MATCH(\"*\",OFFSET(Q85,MATCH(\"\"&U85,Q85:Q$339,0),0):Q$339,0)),\n0)","v":0}]
[null,null,"Jordan",null,"ManufacturingManufacture of food productsManufacture of prepared pet foods","10.92","Manufacturing","Manufacture of food products","Manufacture of prepared pet foods","Medium","Medium","Medium","t12","Not yet drafted",null,{"$f":"IF($G87=Section,\nIF(COUNTIFS(P$22:P86,$H87)=0,$H87,0),\n0)","v":0},{"$f":"IF(AND($G87=Section,$H87=Category),\nIF(COUNTIFS(Q$22:Q86,$I87)=0,$I87,0),\n0)","v":0},null,null,{"$f":"IFERROR(\nINDEX(OFFSET(P86,MATCH(\"\"&T86,P86:P$339,0),0):P$339,MATCH(\"*\",OFFSET(P86,MATCH(\"\"&T86,P86:P$339,0),0):P$339,0)),\n0)","v":0},{"$f":"IFERROR(\nINDEX(OFFSET(Q86,MATCH(\"\"&U86,Q86:Q$339,0),0):Q$339,MATCH(\"*\",OFFSET(Q86,MATCH(\"\"&U86,Q86:Q$339,0),0):Q$339,0)),\n0)","v":0}]
[null,null,"Juan de Nova Island",null,{"$f":"G88&H88&I88","v":"ManufacturingManufacture of beverages (distilled alcoholic beverages, wines, cider and other fruit wines, beer malt, mineral waters and soft drinks)Distilling, rectifying and blending of spirits"},"11.1","Manufacturing","Manufacture of beverages (distilled alcoholic beverages, wines, cider and other fruit wines, beer malt, mineral waters and soft drinks)","Distilling, rectifying and blending of spirits","Excluded","Excluded","Excluded","[n/a]","[n/a]",null,{"$f":"IF($G88=Section,\nIF(COUNTIFS(P$22:P87,$H88)=0,$H88,0),\n0)","v":0},{"$f":"IF(AND($G88=Section,$H88=Category),\nIF(COUNTIFS(Q$22:Q87,$I88)=0,$I88,0),\n0)","v":0},null,null,{"$f":"IFERROR(\nINDEX(OFFSET(P87,MATCH(\"\"&T87,P87:P$339,0),0):P$339,MATCH(\"*\",OFFSET(P87,MATCH(\"\"&T87,P87:P$339,0),0):P$339,0)),\n0)","v":0},{"$f":"IFERROR(\nINDEX(OFFSET(Q87,MATCH(\"\"&U87,Q87:Q$339,0),0):Q$339,MATCH(\"*\",OFFSET(Q87,MATCH(\"\"&U87,Q87:Q$339,0),0):Q$339,0)),\n0)","v":0}]
[null,null,"Kenya",null,"ManufacturingManufacture of beverages (distilled alcoholic beverages, wines, cider and other fruit wines, beer malt, mineral waters and soft drinks)Manufacture of wine from grape","11.2","Manufacturing","Manufacture of beverages (distilled alcoholic beverages, wines, cider and other fruit wines, beer malt, mineral waters and soft drinks)","Manufacture of wine from grape","Medium","Medium","Medium","t100","Drafted",null,{"$f":"IF($G89=Section,\nIF(COUNTIFS(P$22:P88,$H89)=0,$H89,0),\n0)","v":0},{"$f":"IF(AND($G89=Section,$H89=Category),\nIF(COUNTIFS(Q$22:Q88,$I89)=0,$I89,0),\n0)","v":0},null,null,{"$f":"IFERROR(\nINDEX(OFFSET(P88,MATCH(\"\"&T88,P88:P$339,0),0):P$339,MATCH(\"*\",OFFSET(P88,MATCH(\"\"&T88,P88:P$339,0),0):P$339,0)),\n0)","v":0},{"$f":"IFERROR(\nINDEX(OFFSET(Q88,MATCH(\"\"&U88,Q88:Q$339,0),0):Q$339,MATCH(\"*\",OFFSET(Q88,MATCH(\"\"&U88,Q88:Q$339,0),0):Q$339,0)),\n0)","v":0}]
[null,null,"Kosovo",null,"ManufacturingManufacture of beverages (distilled alcoholic beverages, wines, cider and other fruit wines, beer malt, mineral waters and soft drinks)Manufacture of cider and other fruit wines","11.3","Manufacturing","Manufacture of beverages (distilled alcoholic beverages, wines, cider and other fruit wines, beer malt, mineral waters and soft drinks)","Manufacture of cider and other fruit wines","Medium","Medium","Medium","t128","Not yet drafted",null,{"$f":"IF($G90=Section,\nIF(COUNTIFS(P$22:P89,$H90)=0,$H90,0),\n0)","v":0},{"$f":"IF(AND($G90=Section,$H90=Category),\nIF(COUNTIFS(Q$22:Q89,$I90)=0,$I90,0),\n0)","v":0},null,null,{"$f":"IFERROR(\nINDEX(OFFSET(P89,MATCH(\"\"&T89,P89:P$339,0),0):P$339,MATCH(\"*\",OFFSET(P89,MATCH(\"\"&T89,P89:P$339,0),0):P$339,0)),\n0)","v":0},{"$f":"IFERROR(\nINDEX(OFFSET(Q89,MATCH(\"\"&U89,Q89:Q$339,0),0):Q$339,MATCH(\"*\",OFFSET(Q89,MATCH(\"\"&U89,Q89:Q$339,0),0):Q$339,0)),\n0)","v":0}]
[null,null,"Kuwait",null,"ManufacturingManufacture of tobacco products[n/a]","12","Manufacturing","Manufacture of tobacco products","[n/a]","Excluded","Excluded","Excluded","[n/a]","[n/a]",null,{"$f":"IF($G91=Section,\nIF(COUNTIFS(P$22:P90,$H91)=0,$H91,0),\n0)","v":0},{"$f":"IF(AND($G91=Section,$H91=Category),\nIF(COUNTIFS(Q$22:Q90,$I91)=0,$I91,0),\n0)","v":0},null,null,{"$f":"IFERROR(\nINDEX(OFFSET(P90,MATCH(\"\"&T90,P90:P$339,0),0):P$339,MATCH(\"*\",OFFSET(P90,MATCH(\"\"&T90,P90:P$339,0),0):P$339,0)),\n0)","v":0},{"$f":"IFERROR(\nINDEX(OFFSET(Q90,MATCH(\"\"&U90,Q90:Q$339,0),0):Q$339,MATCH(\"*\",OFFSET(Q90,MATCH(\"\"&U90,Q90:Q$339,0),0):Q$339,0)),\n0)","v":0}]
[null,null,"Latvia",null,"ManufacturingManufacture of textilesPreparation of spinning of textile fibres","13.1","Manufacturing","Manufacture of textiles","Preparation of spinning of textile fibres","Medium","High","High","t69","Drafted",null,{"$f":"IF($G92=Section,\nIF(COUNTIFS(P$22:P91,$H92)=0,$H92,0),\n0)","v":0},{"$f":"IF(AND($G92=Section,$H92=Category),\nIF(COUNTIFS(Q$22:Q91,$I92)=0,$I92,0),\n0)","v":0},null,null,{"$f":"IFERROR(\nINDEX(OFFSET(P91,MATCH(\"\"&T91,P91:P$339,0),0):P$339,MATCH(\"*\",OFFSET(P91,MATCH(\"\"&T91,P91:P$339,0),0):P$339,0)),\n0)","v":0},{"$f":"IFERROR(\nINDEX(OFFSET(Q91,MATCH(\"\"&U91,Q91:Q$339,0),0):Q$339,MATCH(\"*\",OFFSET(Q91,MATCH(\"\"&U91,Q91:Q$339,0),0):Q$339,0)),\n0)","v":0}]
[null,null,"Lebanon",null,"ManufacturingManufacture of textilesWeaving of textiles","13.2","Manufacturing","Manufacture of textiles","Weaving of textiles","Medium","High","High","t69","Drafted",null,{"$f":"IF($G93=Section,\nIF(COUNTIFS(P$22:P92,$H93)=0,$H93,0),\n0)","v":0},{"$f":"IF(AND($G93=Section,$H93=Category),\nIF(COUNTIFS(Q$22:Q92,$I93)=0,$I93,0),\n0)","v":0},null,null,{"$f":"IFERROR(\nINDEX(OFFSET(P92,MATCH(\"\"&T92,P92:P$339,0),0):P$339,MATCH(\"*\",OFFSET(P92,MATCH(\"\"&T92,P92:P$339,0),0):P$339,0)),\n0)","v":0},{"$f":"IFERROR(\nINDEX(OFFSET(Q92,MATCH(\"\"&U92,Q92:Q$339,0),0):Q$339,MATCH(\"*\",OFFSET(Q92,MATCH(\"\"&U92,Q92:Q$339,0),0):Q$339,0)),\n0)","v":0}]
[null,null,"Lesotho",null,"ManufacturingManufacture of textilesFinishing of textiles","13.3","Manufacturing","Manufacture of textiles","Finishing of textiles","High","High","High","t69","Drafted",null,{"$f":"IF($G94=Section,\nIF(COUNTIFS(P$22:P93,$H94)=0,$H94,0),\n0)","v":0},{"$f":"IF(AND($G94=Section,$H94=Category),\nIF(COUNTIFS(Q$22:Q93,$I94)=0,$I94,0),\n0)","v":0},null,null,{"$f":"IFERROR(\nINDEX(OFFSET(P93,MATCH(\"\"&T93,P93:P$339,0),0):P$339,MATCH(\"*\",OFFSET(P93,MATCH(\"\"&T93,P93:P$339,0),0):P$339,0)),\n0)","v":0},{"$f":"IFERROR(\nINDEX(OFFSET(Q93,MATCH(\"\"&U93,Q93:Q$339,0),0):Q$339,MATCH(\"*\",OFFSET(Q93,MATCH(\"\"&U93,Q93:Q$339,0),0):Q$339,0)),\n0)","v":0}]
[null,null,"Liberia",null,"ManufacturingManufacture of textilesManufacture of other textiles (e.g. knitted fabrics, made-up textile articles, carpets and rugs, cordage, rope, twine and netting, and non-wovens, except apparel)","13.9","Manufacturing","Manufacture of textiles","Manufacture of other textiles (e.g. knitted fabrics, made-up textile articles, carpets and rugs, cordage, rope, twine and netting, and non-wovens, except apparel)","Medium","High","High","t69","Drafted",null,{"$f":"IF($G95=Section,\nIF(COUNTIFS(P$22:P94,$H95)=0,$H95,0),\n0)","v":0},{"$f":"IF(AND($G95=Section,$H95=Category),\nIF(COUNTIFS(Q$22:Q94,$I95)=0,$I95,0),\n0)","v":0},null,null,{"$f":"IFERROR(\nINDEX(OFFSET(P94,MATCH(\"\"&T94,P94:P$339,0),0):P$339,MATCH(\"*\",OFFSET(P94,MATCH(\"\"&T94,P94:P$339,0),0):P$339,0)),\n0)","v":0},{"$f":"IFERROR(\nINDEX(OFFSET(Q94,MATCH(\"\"&U94,Q94:Q$339,0),0):Q$339,MATCH(\"*\",OFFSET(Q94,MATCH(\"\"&U94,Q94:Q$339,0),0):Q$339,0)),\n0)","v":0}]
[null,null,"Libya",null,"ManufacturingManufacturing of wearing apparelManufacture of wearing apparel, except fur apparel (e.g. leather clothes, workwear, outerwear, underwear, other wearing apparel and accessories)","14.1","Manufacturing","Manufacturing of wearing apparel","Manufacture of wearing apparel, except fur apparel (e.g. leather clothes, workwear, outerwear, underwear, other wearing apparel and accessories)","Medium","High","High","t84","Drafted",null,{"$f":"IF($G96=Section,\nIF(COUNTIFS(P$22:P95,$H96)=0,$H96,0),\n0)","v":0},{"$f":"IF(AND($G96=Section,$H96=Category),\nIF(COUNTIFS(Q$22:Q95,$I96)=0,$I96,0),\n0)","v":0},null,null,{"$f":"IFERROR(\nINDEX(OFFSET(P95,MATCH(\"\"&T95,P95:P$339,0),0):P$339,MATCH(\"*\",OFFSET(P95,MATCH(\"\"&T95,P95:P$339,0),0):P$339,0)),\n0)","v":0},{"$f":"IFERROR(\nINDEX(OFFSET(Q95,MATCH(\"\"&U95,Q95:Q$339,0),0):Q$339,MATCH(\"*\",OFFSET(Q95,MATCH(\"\"&U95,Q95:Q$339,0),0):Q$339,0)),\n0)","v":0}]
[null,null,"Liechtenstein",null,"ManufacturingManufacturing of wearing apparelManufacture of articles of fur","14.2","Manufacturing","Manufacturing of wearing apparel","Manufacture of articles of fur","Medium","High","High","t64","Not yet drafted",null,{"$f":"IF($G97=Section,\nIF(COUNTIFS(P$22:P96,$H97)=0,$H97,0),\n0)","v":0},{"$f":"IF(AND($G97=Section,$H97=Category),\nIF(COUNTIFS(Q$22:Q96,$I97)=0,$I97,0),\n0)","v":0},null,null,{"$f":"IFERROR(\nINDEX(OFFSET(P96,MATCH(\"\"&T96,P96:P$339,0),0):P$339,MATCH(\"*\",OFFSET(P96,MATCH(\"\"&T96,P96:P$339,0),0):P$339,0)),\n0)","v":0},{"$f":"IFERROR(\nINDEX(OFFSET(Q96,MATCH(\"\"&U96,Q96:Q$339,0),0):Q$339,MATCH(\"*\",OFFSET(Q96,MATCH(\"\"&U96,Q96:Q$339,0),0):Q$339,0)),\n0)","v":0}]
[null,null,"Lithuania",null,"ManufacturingManufacturing of wearing apparelManufacture of knotted and crocheted apparel (knitted and crocheted hosiery, other knitted and crocheted apparel)","14.3","Manufacturing","Manufacturing of wearing apparel","Manufacture of knotted and crocheted apparel (knitted and crocheted hosiery, other knitted and crocheted apparel)","Medium","High","High","t84","Drafted",null,{"$f":"IF($G98=Section,\nIF(COUNTIFS(P$22:P97,$H98)=0,$H98,0),\n0)","v":0},{"$f":"IF(AND($G98=Section,$H98=Category),\nIF(COUNTIFS(Q$22:Q97,$I98)=0,$I98,0),\n0)","v":0},null,null,{"$f":"IFERROR(\nINDEX(OFFSET(P97,MATCH(\"\"&T97,P97:P$339,0),0):P$339,MATCH(\"*\",OFFSET(P97,MATCH(\"\"&T97,P97:P$339,0),0):P$339,0)),\n0)","v":0},{"$f":"IFERROR(\nINDEX(OFFSET(Q97,MATCH(\"\"&U97,Q97:Q$339,0),0):Q$339,MATCH(\"*\",OFFSET(Q97,MATCH(\"\"&U97,Q97:Q$339,0),0):Q$339,0)),\n0)","v":0}]
[null,null,"Luxembourg",null,"ManufacturingManufacture of leather and related productsTanning and dressing for leather, manufacture of luggage, handbags, saddlery and harness; dressing and dyeing of fur","15.1","Manufacturing","Manufacture of leather and related products","Tanning and dressing for leather, manufacture of luggage, handbags, saddlery and harness; dressing and dyeing of fur","High","High","High","t76","Drafted",null,{"$f":"IF($G99=Section,\nIF(COUNTIFS(P$22:P98,$H99)=0,$H99,0),\n0)","v":0},{"$f":"IF(AND($G99=Section,$H99=Category),\nIF(COUNTIFS(Q$22:Q98,$I99)=0,$I99,0),\n0)","v":0},null,null,{"$f":"IFERROR(\nINDEX(OFFSET(P98,MATCH(\"\"&T98,P98:P$339,0),0):P$339,MATCH(\"*\",OFFSET(P98,MATCH(\"\"&T98,P98:P$339,0),0):P$339,0)),\n0)","v":0},{"$f":"IFERROR(\nINDEX(OFFSET(Q98,MATCH(\"\"&U98,Q98:Q$339,0),0):Q$339,MATCH(\"*\",OFFSET(Q98,MATCH(\"\"&U98,Q98:Q$339,0),0):Q$339,0)),\n0)","v":0}]
[null,null,"Macedonia",null,"ManufacturingManufacture of leather and related productsTanning and dressing of leather; dressing and dyeing of fur","15.11","Manufacturing","Manufacture of leather and related products","Tanning and dressing of leather; dressing and dyeing of fur","High","High","High","t76","Drafted",null,{"$f":"IF($G100=Section,\nIF(COUNTIFS(P$22:P99,$H100)=0,$H100,0),\n0)","v":0},{"$f":"IF(AND($G100=Section,$H100=Category),\nIF(COUNTIFS(Q$22:Q99,$I100)=0,$I100,0),\n0)","v":0},null,null,{"$f":"IFERROR(\nINDEX(OFFSET(P99,MATCH(\"\"&T99,P99:P$339,0),0):P$339,MATCH(\"*\",OFFSET(P99,MATCH(\"\"&T99,P99:P$339,0),0):P$339,0)),\n0)","v":0},{"$f":"IFERROR(\nINDEX(OFFSET(Q99,MATCH(\"\"&U99,Q99:Q$339,0),0):Q$339,MATCH(\"*\",OFFSET(Q99,MATCH(\"\"&U99,Q99:Q$339,0),0):Q$339,0)),\n0)","v":0}]
[null,null,"Madagascar",null,"ManufacturingManufacture of leather and related productsManufacture of luggage, handbags and the like, saddlery and harness","15.12","Manufacturing","Manufacture of leather and related products","Manufacture of luggage, handbags and the like, saddlery and harness","Medium","High","High","t76","Drafted",null,{"$f":"IF($G101=Section,\nIF(COUNTIFS(P$22:P100,$H101)=0,$H101,0),\n0)","v":0},{"$f":"IF(AND($G101=Section,$H101=Category),\nIF(COUNTIFS(Q$22:Q100,$I101)=0,$I101,0),\n0)","v":0},null,null,{"$f":"IFERROR(\nINDEX(OFFSET(P100,MATCH(\"\"&T100,P100:P$339,0),0):P$339,MATCH(\"*\",OFFSET(P100,MATCH(\"\"&T100,P100:P$339,0),0):P$339,0)),\n0)","v":0},{"$f":"IFERROR(\nINDEX(OFFSET(Q100,MATCH(\"\"&U100,Q100:Q$339,0),0):Q$339,MATCH(\"*\",OFFSET(Q100,MATCH(\"\"&U100,Q100:Q$339,0),0):Q$339,0)),\n0)","v":0}]
[null,null,"Malawi",null,"ManufacturingManufacture of leather and related productsManufacture of footwear","15.2","Manufacturing","Manufacture of leather and related products","Manufacture of footwear","Medium","High","High","t84","Drafted",null,{"$f":"IF($G102=Section,\nIF(COUNTIFS(P$22:P101,$H102)=0,$H102,0),\n0)","v":0},{"$f":"IF(AND($G102=Section,$H102=Category),\nIF(COUNTIFS(Q$22:Q101,$I102)=0,$I102,0),\n0)","v":0},null,null,{"$f":"IFERROR(\nINDEX(OFFSET(P101,MATCH(\"\"&T101,P101:P$339,0),0):P$339,MATCH(\"*\",OFFSET(P101,MATCH(\"\"&T101,P101:P$339,0),0):P$339,0)),\n0)","v":0},{"$f":"IFERROR(\nINDEX(OFFSET(Q101,MATCH(\"\"&U101,Q101:Q$339,0),0):Q$339,MATCH(\"*\",OFFSET(Q101,MATCH(\"\"&U101,Q101:Q$339,0),0):Q$339,0)),\n0)","v":0}]
[null,null,"Mali",null,"ManufacturingManufacture of wood and products of wood, cork and straw, except furnitureSawmilling and planing of wood","16.1","Manufacturing","Manufacture of wood and products of wood, cork and straw, except furniture","Sawmilling and planing of wood","Medium","Medium","Medium","t86","Drafted",null,{"$f":"IF($G103=Section,\nIF(COUNTIFS(P$22:P102,$H103)=0,$H103,0),\n0)","v":0},{"$f":"IF(AND($G103=Section,$H103=Category),\nIF(COUNTIFS(Q$22:Q102,$I103)=0,$I103,0),\n0)","v":0},null,null,{"$f":"IFERROR(\nINDEX(OFFSET(P102,MATCH(\"\"&T102,P102:P$339,0),0):P$339,MATCH(\"*\",OFFSET(P102,MATCH(\"\"&T102,P102:P$339,0),0):P$339,0)),\n0)","v":0},{"$f":"IFERROR(\nINDEX(OFFSET(Q102,MATCH(\"\"&U102,Q102:Q$339,0),0):Q$339,MATCH(\"*\",OFFSET(Q102,MATCH(\"\"&U102,Q102:Q$339,0),0):Q$339,0)),\n0)","v":0}]
[null,null,"Malta",null,"ManufacturingManufacture of wood and products of wood, cork and straw, except furnitureManufacture of wood, cork and straw products (incl. veneer sheets, wood panels, assembled parquet floors, etc.)","16.2","Manufacturing","Manufacture of wood and products of wood, cork and straw, except furniture","Manufacture of wood, cork and straw products (incl. veneer sheets, wood panels, assembled parquet floors, etc.)","Medium","Medium","Medium","t28","Not yet drafted",null,{"$f":"IF($G104=Section,\nIF(COUNTIFS(P$22:P103,$H104)=0,$H104,0),\n0)","v":0},{"$f":"IF(AND($G104=Section,$H104=Category),\nIF(COUNTIFS(Q$22:Q103,$I104)=0,$I104,0),\n0)","v":0},null,null,{"$f":"IFERROR(\nINDEX(OFFSET(P103,MATCH(\"\"&T103,P103:P$339,0),0):P$339,MATCH(\"*\",OFFSET(P103,MATCH(\"\"&T103,P103:P$339,0),0):P$339,0)),\n0)","v":0},{"$f":"IFERROR(\nINDEX(OFFSET(Q103,MATCH(\"\"&U103,Q103:Q$339,0),0):Q$339,MATCH(\"*\",OFFSET(Q103,MATCH(\"\"&U103,Q103:Q$339,0),0):Q$339,0)),\n0)","v":0}]
[null,null,"Mauritania",null,"ManufacturingManufacture of paper and paper productsManufacture of pulp","17.11","Manufacturing","Manufacture of paper and paper products","Manufacture of pulp","High","High","High","t78","Drafted",null,{"$f":"IF($G105=Section,\nIF(COUNTIFS(P$22:P104,$H105)=0,$H105,0),\n0)","v":0},{"$f":"IF(AND($G105=Section,$H105=Category),\nIF(COUNTIFS(Q$22:Q104,$I105)=0,$I105,0),\n0)","v":0},null,null,{"$f":"IFERROR(\nINDEX(OFFSET(P104,MATCH(\"\"&T104,P104:P$339,0),0):P$339,MATCH(\"*\",OFFSET(P104,MATCH(\"\"&T104,P104:P$339,0),0):P$339,0)),\n0)","v":0},{"$f":"IFERROR(\nINDEX(OFFSET(Q104,MATCH(\"\"&U104,Q104:Q$339,0),0):Q$339,MATCH(\"*\",OFFSET(Q104,MATCH(\"\"&U104,Q104:Q$339,0),0):Q$339,0)),\n0)","v":0}]
[null,null,"Mauritius",null,"ManufacturingManufacture of paper and paper productsManufacture of paper and paperboard","17.12","Manufacturing","Manufacture of paper and paper products","Manufacture of paper and paperboard","Medium","Medium","Medium","t78","Drafted",null,{"$f":"IF($G106=Section,\nIF(COUNTIFS(P$22:P105,$H106)=0,$H106,0),\n0)","v":0},{"$f":"IF(AND($G106=Section,$H106=Category),\nIF(COUNTIFS(Q$22:Q105,$I106)=0,$I106,0),\n0)","v":0},null,null,{"$f":"IFERROR(\nINDEX(OFFSET(P105,MATCH(\"\"&T105,P105:P$339,0),0):P$339,MATCH(\"*\",OFFSET(P105,MATCH(\"\"&T105,P105:P$339,0),0):P$339,0)),\n0)","v":0},{"$f":"IFERROR(\nINDEX(OFFSET(Q105,MATCH(\"\"&U105,Q105:Q$339,0),0):Q$339,MATCH(\"*\",OFFSET(Q105,MATCH(\"\"&U105,Q105:Q$339,0),0):Q$339,0)),\n0)","v":0}]
[null,null,"Mayotte",null,"ManufacturingManufacture of paper and paper productsManufacture of articles of paperboard","17.2","Manufacturing","Manufacture of paper and paper products","Manufacture of articles of paperboard","Medium","Medium","Medium","t78","Drafted",null,{"$f":"IF($G107=Section,\nIF(COUNTIFS(P$22:P106,$H107)=0,$H107,0),\n0)","v":0},{"$f":"IF(AND($G107=Section,$H107=Category),\nIF(COUNTIFS(Q$22:Q106,$I107)=0,$I107,0),\n0)","v":0},null,null,{"$f":"IFERROR(\nINDEX(OFFSET(P106,MATCH(\"\"&T106,P106:P$339,0),0):P$339,MATCH(\"*\",OFFSET(P106,MATCH(\"\"&T106,P106:P$339,0),0):P$339,0)),\n0)","v":0},{"$f":"IFERROR(\nINDEX(OFFSET(Q106,MATCH(\"\"&U106,Q106:Q$339,0),0):Q$339,MATCH(\"*\",OFFSET(Q106,MATCH(\"\"&U106,Q106:Q$339,0),0):Q$339,0)),\n0)","v":0}]
[null,null,"Moldova",null,"ManufacturingPrinting and reproduction of recorded mediaPrinting and service activities related to printing","18.1","Manufacturing","Printing and reproduction of recorded media","Printing and service activities related to printing","Medium","Low","Medium","t90","Drafted",null,{"$f":"IF($G108=Section,\nIF(COUNTIFS(P$22:P107,$H108)=0,$H108,0),\n0)","v":0},{"$f":"IF(AND($G108=Section,$H108=Category),\nIF(COUNTIFS(Q$22:Q107,$I108)=0,$I108,0),\n0)","v":0},null,null,{"$f":"IFERROR(\nINDEX(OFFSET(P107,MATCH(\"\"&T107,P107:P$339,0),0):P$339,MATCH(\"*\",OFFSET(P107,MATCH(\"\"&T107,P107:P$339,0),0):P$339,0)),\n0)","v":0},{"$f":"IFERROR(\nINDEX(OFFSET(Q107,MATCH(\"\"&U107,Q107:Q$339,0),0):Q$339,MATCH(\"*\",OFFSET(Q107,MATCH(\"\"&U107,Q107:Q$339,0),0):Q$339,0)),\n0)","v":0}]
[null,null,"Monaco",null,"ManufacturingPrinting and reproduction of recorded mediaReproduction of recorded media","18.2","Manufacturing","Printing and reproduction of recorded media","Reproduction of recorded media","Low","Low","Low","[n/a]","[n/a]",null,{"$f":"IF($G109=Section,\nIF(COUNTIFS(P$22:P108,$H109)=0,$H109,0),\n0)","v":0},{"$f":"IF(AND($G109=Section,$H109=Category),\nIF(COUNTIFS(Q$22:Q108,$I109)=0,$I109,0),\n0)","v":0},null,null,{"$f":"IFERROR(\nINDEX(OFFSET(P108,MATCH(\"\"&T108,P108:P$339,0),0):P$339,MATCH(\"*\",OFFSET(P108,MATCH(\"\"&T108,P108:P$339,0),0):P$339,0)),\n0)","v":0},{"$f":"IFERROR(\nINDEX(OFFSET(Q108,MATCH(\"\"&U108,Q108:Q$339,0),0):Q$339,MATCH(\"*\",OFFSET(Q108,MATCH(\"\"&U108,Q108:Q$339,0),0):Q$339,0)),\n0)","v":0}]
[null,null,"Montenegro",null,"ManufacturingManufacture of coke and refined petroleum productsManufacture of coke oven products","19.1","Manufacturing","Manufacture of coke and refined petroleum products","Manufacture of coke oven products","High","High","High","t18","Not yet drafted",null,{"$f":"IF($G110=Section,\nIF(COUNTIFS(P$22:P109,$H110)=0,$H110,0),\n0)","v":0},{"$f":"IF(AND($G110=Section,$H110=Category),\nIF(COUNTIFS(Q$22:Q109,$I110)=0,$I110,0),\n0)","v":0},null,null,{"$f":"IFERROR(\nINDEX(OFFSET(P109,MATCH(\"\"&T109,P109:P$339,0),0):P$339,MATCH(\"*\",OFFSET(P109,MATCH(\"\"&T109,P109:P$339,0),0):P$339,0)),\n0)","v":0},{"$f":"IFERROR(\nINDEX(OFFSET(Q109,MATCH(\"\"&U109,Q109:Q$339,0),0):Q$339,MATCH(\"*\",OFFSET(Q109,MATCH(\"\"&U109,Q109:Q$339,0),0):Q$339,0)),\n0)","v":0}]
[null,null,"Morocco",null,"ManufacturingManufacture of coke and refined petroleum productsManufacture of refined petroleum products","19.2","Manufacturing","Manufacture of coke and refined petroleum products","Manufacture of refined petroleum products","High","High","High","t82","Drafted",null,{"$f":"IF($G111=Section,\nIF(COUNTIFS(P$22:P110,$H111)=0,$H111,0),\n0)","v":0},{"$f":"IF(AND($G111=Section,$H111=Category),\nIF(COUNTIFS(Q$22:Q110,$I111)=0,$I111,0),\n0)","v":0},null,null,{"$f":"IFERROR(\nINDEX(OFFSET(P110,MATCH(\"\"&T110,P110:P$339,0),0):P$339,MATCH(\"*\",OFFSET(P110,MATCH(\"\"&T110,P110:P$339,0),0):P$339,0)),\n0)","v":0},{"$f":"IFERROR(\nINDEX(OFFSET(Q110,MATCH(\"\"&U110,Q110:Q$339,0),0):Q$339,MATCH(\"*\",OFFSET(Q110,MATCH(\"\"&U110,Q110:Q$339,0),0):Q$339,0)),\n0)","v":0}]
[null,null,"Mozambique",null,"ManufacturingManufacture of chemicals and chemical productsManufacture of basic chemicals (e.g. industrial gases, dyes and pigments), fertilisers and nitrogen compounds, plastics and synthetic rubber","20.1","Manufacturing","Manufacture of chemicals and chemical products","Manufacture of basic chemicals (e.g. industrial gases, dyes and pigments), fertilisers and nitrogen compounds, plastics and synthetic rubber","High","High","High","t62","Not yet drafted",null,{"$f":"IF($G112=Section,\nIF(COUNTIFS(P$22:P111,$H112)=0,$H112,0),\n0)","v":0},{"$f":"IF(AND($G112=Section,$H112=Category),\nIF(COUNTIFS(Q$22:Q111,$I112)=0,$I112,0),\n0)","v":0},null,null,{"$f":"IFERROR(\nINDEX(OFFSET(P111,MATCH(\"\"&T111,P111:P$339,0),0):P$339,MATCH(\"*\",OFFSET(P111,MATCH(\"\"&T111,P111:P$339,0),0):P$339,0)),\n0)","v":0},{"$f":"IFERROR(\nINDEX(OFFSET(Q111,MATCH(\"\"&U111,Q111:Q$339,0),0):Q$339,MATCH(\"*\",OFFSET(Q111,MATCH(\"\"&U111,Q111:Q$339,0),0):Q$339,0)),\n0)","v":0}]
[null,null,"Namibia",null,"ManufacturingManufacture of chemicals and chemical productsManufacture of pesticides and other agrochemical products","20.2","Manufacturing","Manufacture of chemicals and chemical products","Manufacture of pesticides and other agrochemical products","High","High","High","t79","Drafted",null,{"$f":"IF($G113=Section,\nIF(COUNTIFS(P$22:P112,$H113)=0,$H113,0),\n0)","v":0},{"$f":"IF(AND($G113=Section,$H113=Category),\nIF(COUNTIFS(Q$22:Q112,$I113)=0,$I113,0),\n0)","v":0},null,null,{"$f":"IFERROR(\nINDEX(OFFSET(P112,MATCH(\"\"&T112,P112:P$339,0),0):P$339,MATCH(\"*\",OFFSET(P112,MATCH(\"\"&T112,P112:P$339,0),0):P$339,0)),\n0)","v":0},{"$f":"IFERROR(\nINDEX(OFFSET(Q112,MATCH(\"\"&U112,Q112:Q$339,0),0):Q$339,MATCH(\"*\",OFFSET(Q112,MATCH(\"\"&U112,Q112:Q$339,0),0):Q$339,0)),\n0)","v":0}]
[null,null,"Netherlands",null,"ManufacturingManufacture of chemicals and chemical productsManufacture of paints, varnishes and similar coatings, printing ink and mastics","20.3","Manufacturing","Manufacture of chemicals and chemical products","Manufacture of paints, varnishes and similar coatings, printing ink and mastics","High","High","High","t83","Drafted",null,{"$f":"IF($G114=Section,\nIF(COUNTIFS(P$22:P113,$H114)=0,$H114,0),\n0)","v":0},{"$f":"IF(AND($G114=Section,$H114=Category),\nIF(COUNTIFS(Q$22:Q113,$I114)=0,$I114,0),\n0)","v":0},null,null,{"$f":"IFERROR(\nINDEX(OFFSET(P113,MATCH(\"\"&T113,P113:P$339,0),0):P$339,MATCH(\"*\",OFFSET(P113,MATCH(\"\"&T113,P113:P$339,0),0):P$339,0)),\n0)","v":0},{"$f":"IFERROR(\nINDEX(OFFSET(Q113,MATCH(\"\"&U113,Q113:Q$339,0),0):Q$339,MATCH(\"*\",OFFSET(Q113,MATCH(\"\"&U113,Q113:Q$339,0),0):Q$339,0)),\n0)","v":0}]
[null,null,"Niger",null,"ManufacturingManufacture of chemicals and chemical productsManufacture of soap and detergents, cleaning and polishing preparations, perfumes and toilet preparations","20.4","Manufacturing","Manufacture of chemicals and chemical products","Manufacture of soap and detergents, cleaning and polishing preparations, perfumes and toilet preparations","High","High","High","t16","Not yet drafted",null,{"$f":"IF($G115=Section,\nIF(COUNTIFS(P$22:P114,$H115)=0,$H115,0),\n0)","v":0},{"$f":"IF(AND($G115=Section,$H115=Category),\nIF(COUNTIFS(Q$22:Q114,$I115)=0,$I115,0),\n0)","v":0},null,null,{"$f":"IFERROR(\nINDEX(OFFSET(P114,MATCH(\"\"&T114,P114:P$339,0),0):P$339,MATCH(\"*\",OFFSET(P114,MATCH(\"\"&T114,P114:P$339,0),0):P$339,0)),\n0)","v":0},{"$f":"IFERROR(\nINDEX(OFFSET(Q114,MATCH(\"\"&U114,Q114:Q$339,0),0):Q$339,MATCH(\"*\",OFFSET(Q114,MATCH(\"\"&U114,Q114:Q$339,0),0):Q$339,0)),\n0)","v":0}]
[null,null,"Nigeria",null,"ManufacturingManufacture of chemicals and chemical productsManufacture of other chemical products (explosives, glues, essential oils, other chemical products)","20.5","Manufacturing","Manufacture of chemicals and chemical products","Manufacture of other chemical products (explosives, glues, essential oils, other chemical products)","High","High","High","t62","Not yet drafted",null,{"$f":"IF($G116=Section,\nIF(COUNTIFS(P$22:P115,$H116)=0,$H116,0),\n0)","v":0},{"$f":"IF(AND($G116=Section,$H116=Category),\nIF(COUNTIFS(Q$22:Q115,$I116)=0,$I116,0),\n0)","v":0},null,null,{"$f":"IFERROR(\nINDEX(OFFSET(P115,MATCH(\"\"&T115,P115:P$339,0),0):P$339,MATCH(\"*\",OFFSET(P115,MATCH(\"\"&T115,P115:P$339,0),0):P$339,0)),\n0)","v":0},{"$f":"IFERROR(\nINDEX(OFFSET(Q115,MATCH(\"\"&U115,Q115:Q$339,0),0):Q$339,MATCH(\"*\",OFFSET(Q115,MATCH(\"\"&U115,Q115:Q$339,0),0):Q$339,0)),\n0)","v":0}]
[null,null,"Norway",null,"ManufacturingManufacture of chemicals and chemical productsManufacture of man-made fibres","20.6","Manufacturing","Manufacture of chemicals and chemical products","Manufacture of man-made fibres","High","High","High","t23","Not yet drafted",null,{"$f":"IF($G117=Section,\nIF(COUNTIFS(P$22:P116,$H117)=0,$H117,0),\n0)","v":0},{"$f":"IF(AND($G117=Section,$H117=Category),\nIF(COUNTIFS(Q$22:Q116,$I117)=0,$I117,0),\n0)","v":0},null,null,{"$f":"IFERROR(\nINDEX(OFFSET(P116,MATCH(\"\"&T116,P116:P$339,0),0):P$339,MATCH(\"*\",OFFSET(P116,MATCH(\"\"&T116,P116:P$339,0),0):P$339,0)),\n0)","v":0},{"$f":"IFERROR(\nINDEX(OFFSET(Q116,MATCH(\"\"&U116,Q116:Q$339,0),0):Q$339,MATCH(\"*\",OFFSET(Q116,MATCH(\"\"&U116,Q116:Q$339,0),0):Q$339,0)),\n0)","v":0}]
[null,null,"Oman",null,"ManufacturingManufacture of basic pharmaceutical products and pharmaceutical preparations [n/a]","21","Manufacturing","Manufacture of basic pharmaceutical products and pharmaceutical preparations ","[n/a]","High","High","High","t73","Drafted",null,{"$f":"IF($G118=Section,\nIF(COUNTIFS(P$22:P117,$H118)=0,$H118,0),\n0)","v":0},{"$f":"IF(AND($G118=Section,$H118=Category),\nIF(COUNTIFS(Q$22:Q117,$I118)=0,$I118,0),\n0)","v":0},null,null,{"$f":"IFERROR(\nINDEX(OFFSET(P117,MATCH(\"\"&T117,P117:P$339,0),0):P$339,MATCH(\"*\",OFFSET(P117,MATCH(\"\"&T117,P117:P$339,0),0):P$339,0)),\n0)","v":0},{"$f":"IFERROR(\nINDEX(OFFSET(Q117,MATCH(\"\"&U117,Q117:Q$339,0),0):Q$339,MATCH(\"*\",OFFSET(Q117,MATCH(\"\"&U117,Q117:Q$339,0),0):Q$339,0)),\n0)","v":0}]
[null,null,"Poland",null,"ManufacturingManufacture of rubber and plastic productsManufacture of rubber tyres and tubes; retreading and rebuilding of rubber tyres","22.11","Manufacturing","Manufacture of rubber and plastic products","Manufacture of rubber tyres and tubes; retreading and rebuilding of rubber tyres","High","High","High","t77","Drafted",null,{"$f":"IF($G119=Section,\nIF(COUNTIFS(P$22:P118,$H119)=0,$H119,0),\n0)","v":0},{"$f":"IF(AND($G119=Section,$H119=Category),\nIF(COUNTIFS(Q$22:Q118,$I119)=0,$I119,0),\n0)","v":0},null,null,{"$f":"IFERROR(\nINDEX(OFFSET(P118,MATCH(\"\"&T118,P118:P$339,0),0):P$339,MATCH(\"*\",OFFSET(P118,MATCH(\"\"&T118,P118:P$339,0),0):P$339,0)),\n0)","v":0},{"$f":"IFERROR(\nINDEX(OFFSET(Q118,MATCH(\"\"&U118,Q118:Q$339,0),0):Q$339,MATCH(\"*\",OFFSET(Q118,MATCH(\"\"&U118,Q118:Q$339,0),0):Q$339,0)),\n0)","v":0}]
[null,null,"Portugal",null,"ManufacturingManufacture of rubber and plastic productsManufacture of other rubber products (plastic plates, sheets, tubes and profiles, plastic packing goods, etc)","22.19","Manufacturing","Manufacture of rubber and plastic products","Manufacture of other rubber products (plastic plates, sheets, tubes and profiles, plastic packing goods, etc)","Medium","High","High","t77","Drafted",null,{"$f":"IF($G120=Section,\nIF(COUNTIFS(P$22:P119,$H120)=0,$H120,0),\n0)","v":0},{"$f":"IF(AND($G120=Section,$H120=Category),\nIF(COUNTIFS(Q$22:Q119,$I120)=0,$I120,0),\n0)","v":0},null,null,{"$f":"IFERROR(\nINDEX(OFFSET(P119,MATCH(\"\"&T119,P119:P$339,0),0):P$339,MATCH(\"*\",OFFSET(P119,MATCH(\"\"&T119,P119:P$339,0),0):P$339,0)),\n0)","v":0},{"$f":"IFERROR(\nINDEX(OFFSET(Q119,MATCH(\"\"&U119,Q119:Q$339,0),0):Q$339,MATCH(\"*\",OFFSET(Q119,MATCH(\"\"&U119,Q119:Q$339,0),0):Q$339,0)),\n0)","v":0}]
[null,null,"Qatar",null,"ManufacturingManufacture of rubber and plastic productsManufacture of plastic products","22.2","Manufacturing","Manufacture of rubber and plastic products","Manufacture of plastic products","High","High","High","t67","Drafted",null,{"$f":"IF($G121=Section,\nIF(COUNTIFS(P$22:P120,$H121)=0,$H121,0),\n0)","v":0},{"$f":"IF(AND($G121=Section,$H121=Category),\nIF(COUNTIFS(Q$22:Q120,$I121)=0,$I121,0),\n0)","v":0},null,null,{"$f":"IFERROR(\nINDEX(OFFSET(P120,MATCH(\"\"&T120,P120:P$339,0),0):P$339,MATCH(\"*\",OFFSET(P120,MATCH(\"\"&T120,P120:P$339,0),0):P$339,0)),\n0)","v":0},{"$f":"IFERROR(\nINDEX(OFFSET(Q120,MATCH(\"\"&U120,Q120:Q$339,0),0):Q$339,MATCH(\"*\",OFFSET(Q120,MATCH(\"\"&U120,Q120:Q$339,0),0):Q$339,0)),\n0)","v":0}]
[null,null,"Reunion",null,"ManufacturingManufacture of other non-metallic mineral productsManufacture of glass and glass products","23.1","Manufacturing","Manufacture of other non-metallic mineral products","Manufacture of glass and glass products","Medium","Medium","Medium","t127","Not yet drafted",null,{"$f":"IF($G122=Section,\nIF(COUNTIFS(P$22:P121,$H122)=0,$H122,0),\n0)","v":0},{"$f":"IF(AND($G122=Section,$H122=Category),\nIF(COUNTIFS(Q$22:Q121,$I122)=0,$I122,0),\n0)","v":0},null,null,{"$f":"IFERROR(\nINDEX(OFFSET(P121,MATCH(\"\"&T121,P121:P$339,0),0):P$339,MATCH(\"*\",OFFSET(P121,MATCH(\"\"&T121,P121:P$339,0),0):P$339,0)),\n0)","v":0},{"$f":"IFERROR(\nINDEX(OFFSET(Q121,MATCH(\"\"&U121,Q121:Q$339,0),0):Q$339,MATCH(\"*\",OFFSET(Q121,MATCH(\"\"&U121,Q121:Q$339,0),0):Q$339,0)),\n0)","v":0}]
[null,null,"Romania",null,"ManufacturingManufacture of other non-metallic mineral productsManufacture of refractory products","23.2","Manufacturing","Manufacture of other non-metallic mineral products","Manufacture of refractory products","Medium","Medium","Medium","t123","Not yet drafted",null,{"$f":"IF($G123=Section,\nIF(COUNTIFS(P$22:P122,$H123)=0,$H123,0),\n0)","v":0},{"$f":"IF(AND($G123=Section,$H123=Category),\nIF(COUNTIFS(Q$22:Q122,$I123)=0,$I123,0),\n0)","v":0},null,null,{"$f":"IFERROR(\nINDEX(OFFSET(P122,MATCH(\"\"&T122,P122:P$339,0),0):P$339,MATCH(\"*\",OFFSET(P122,MATCH(\"\"&T122,P122:P$339,0),0):P$339,0)),\n0)","v":0},{"$f":"IFERROR(\nINDEX(OFFSET(Q122,MATCH(\"\"&U122,Q122:Q$339,0),0):Q$339,MATCH(\"*\",OFFSET(Q122,MATCH(\"\"&U122,Q122:Q$339,0),0):Q$339,0)),\n0)","v":0}]
[null,null,"Russia",null,"ManufacturingManufacture of other non-metallic mineral productsManufacture of clay building materials (ceramic tiles, and flags, bricks, tiles and construction products, in baked clay)","23.3","Manufacturing","Manufacture of other non-metallic mineral products","Manufacture of clay building materials (ceramic tiles, and flags, bricks, tiles and construction products, in baked clay)","Medium","Medium","Medium","t21","Not yet drafted",null,{"$f":"IF($G124=Section,\nIF(COUNTIFS(P$22:P123,$H124)=0,$H124,0),\n0)","v":0},{"$f":"IF(AND($G124=Section,$H124=Category),\nIF(COUNTIFS(Q$22:Q123,$I124)=0,$I124,0),\n0)","v":0},null,null,{"$f":"IFERROR(\nINDEX(OFFSET(P123,MATCH(\"\"&T123,P123:P$339,0),0):P$339,MATCH(\"*\",OFFSET(P123,MATCH(\"\"&T123,P123:P$339,0),0):P$339,0)),\n0)","v":0},{"$f":"IFERROR(\nINDEX(OFFSET(Q123,MATCH(\"\"&U123,Q123:Q$339,0),0):Q$339,MATCH(\"*\",OFFSET(Q123,MATCH(\"\"&U123,Q123:Q$339,0),0):Q$339,0)),\n0)","v":0}]
[null,null,"Rwanda",null,"ManufacturingManufacture of other non-metallic mineral productsManufacture of porcelain and ceramic products","23.4","Manufacturing","Manufacture of other non-metallic mineral products","Manufacture of porcelain and ceramic products","Medium","Medium","Medium","t22","Not yet drafted",null,{"$f":"IF($G125=Section,\nIF(COUNTIFS(P$22:P124,$H125)=0,$H125,0),\n0)","v":0},{"$f":"IF(AND($G125=Section,$H125=Category),\nIF(COUNTIFS(Q$22:Q124,$I125)=0,$I125,0),\n0)","v":0},null,null,{"$f":"IFERROR(\nINDEX(OFFSET(P124,MATCH(\"\"&T124,P124:P$339,0),0):P$339,MATCH(\"*\",OFFSET(P124,MATCH(\"\"&T124,P124:P$339,0),0):P$339,0)),\n0)","v":0},{"$f":"IFERROR(\nINDEX(OFFSET(Q124,MATCH(\"\"&U124,Q124:Q$339,0),0):Q$339,MATCH(\"*\",OFFSET(Q124,MATCH(\"\"&U124,Q124:Q$339,0),0):Q$339,0)),\n0)","v":0}]
[null,null,"Saint Helena",null,"ManufacturingManufacture of other non-metallic mineral productsManufacture of cement, lime and plaster","23.5","Manufacturing","Manufacture of other non-metallic mineral products","Manufacture of cement, lime and plaster","High","Medium","High","t110","Drafted",null,{"$f":"IF($G126=Section,\nIF(COUNTIFS(P$22:P125,$H126)=0,$H126,0),\n0)","v":0},{"$f":"IF(AND($G126=Section,$H126=Category),\nIF(COUNTIFS(Q$22:Q125,$I126)=0,$I126,0),\n0)","v":0},null,null,{"$f":"IFERROR(\nINDEX(OFFSET(P125,MATCH(\"\"&T125,P125:P$339,0),0):P$339,MATCH(\"*\",OFFSET(P125,MATCH(\"\"&T125,P125:P$339,0),0):P$339,0)),\n0)","v":0},{"$f":"IFERROR(\nINDEX(OFFSET(Q125,MATCH(\"\"&U125,Q125:Q$339,0),0):Q$339,MATCH(\"*\",OFFSET(Q125,MATCH(\"\"&U125,Q125:Q$339,0),0):Q$339,0)),\n0)","v":0}]
[null,null,"San Marino",null,"ManufacturingManufacture of other non-metallic mineral productsManufacture of articles of concrete, cement and plaster","23.6","Manufacturing","Manufacture of other non-metallic mineral products","Manufacture of articles of concrete, cement and plaster","Medium","Medium","Medium","t110","Drafted",null,{"$f":"IF($G127=Section,\nIF(COUNTIFS(P$22:P126,$H127)=0,$H127,0),\n0)","v":0},{"$f":"IF(AND($G127=Section,$H127=Category),\nIF(COUNTIFS(Q$22:Q126,$I127)=0,$I127,0),\n0)","v":0},null,null,{"$f":"IFERROR(\nINDEX(OFFSET(P126,MATCH(\"\"&T126,P126:P$339,0),0):P$339,MATCH(\"*\",OFFSET(P126,MATCH(\"\"&T126,P126:P$339,0),0):P$339,0)),\n0)","v":0},{"$f":"IFERROR(\nINDEX(OFFSET(Q126,MATCH(\"\"&U126,Q126:Q$339,0),0):Q$339,MATCH(\"*\",OFFSET(Q126,MATCH(\"\"&U126,Q126:Q$339,0),0):Q$339,0)),\n0)","v":0}]
[null,null,"Sao Tome and Principe",null,"ManufacturingManufacture of other non-metallic mineral productsCutting, shaping and finishing of stone","23.7","Manufacturing","Manufacture of other non-metallic mineral products","Cutting, shaping and finishing of stone","Medium","Medium","Medium","t33","Not yet drafted",null,{"$f":"IF($G128=Section,\nIF(COUNTIFS(P$22:P127,$H128)=0,$H128,0),\n0)","v":0},{"$f":"IF(AND($G128=Section,$H128=Category),\nIF(COUNTIFS(Q$22:Q127,$I128)=0,$I128,0),\n0)","v":0},null,null,{"$f":"IFERROR(\nINDEX(OFFSET(P127,MATCH(\"\"&T127,P127:P$339,0),0):P$339,MATCH(\"*\",OFFSET(P127,MATCH(\"\"&T127,P127:P$339,0),0):P$339,0)),\n0)","v":0},{"$f":"IFERROR(\nINDEX(OFFSET(Q127,MATCH(\"\"&U127,Q127:Q$339,0),0):Q$339,MATCH(\"*\",OFFSET(Q127,MATCH(\"\"&U127,Q127:Q$339,0),0):Q$339,0)),\n0)","v":0}]
[null,null,"Saudi Arabia",null,"ManufacturingManufacture of other non-metallic mineral productsManufacture of abrasive products and non-metallic mineral products not elsewhere classified","23.9","Manufacturing","Manufacture of other non-metallic mineral products","Manufacture of abrasive products and non-metallic mineral products not elsewhere classified","Medium","Medium","Medium","t34","Not yet drafted",null,{"$f":"IF($G129=Section,\nIF(COUNTIFS(P$22:P128,$H129)=0,$H129,0),\n0)","v":0},{"$f":"IF(AND($G129=Section,$H129=Category),\nIF(COUNTIFS(Q$22:Q128,$I129)=0,$I129,0),\n0)","v":0},null,null,{"$f":"IFERROR(\nINDEX(OFFSET(P128,MATCH(\"\"&T128,P128:P$339,0),0):P$339,MATCH(\"*\",OFFSET(P128,MATCH(\"\"&T128,P128:P$339,0),0):P$339,0)),\n0)","v":0},{"$f":"IFERROR(\nINDEX(OFFSET(Q128,MATCH(\"\"&U128,Q128:Q$339,0),0):Q$339,MATCH(\"*\",OFFSET(Q128,MATCH(\"\"&U128,Q128:Q$339,0),0):Q$339,0)),\n0)","v":0}]
[null,null,"Senegal",null,"ManufacturingManufacture of basic metalsManufacture of basic iron and steel and of ferro-alloys","24.1","Manufacturing","Manufacture of basic metals","Manufacture of basic iron and steel and of ferro-alloys","High","High","High","t80","Drafted",null,{"$f":"IF($G130=Section,\nIF(COUNTIFS(P$22:P129,$H130)=0,$H130,0),\n0)","v":0},{"$f":"IF(AND($G130=Section,$H130=Category),\nIF(COUNTIFS(Q$22:Q129,$I130)=0,$I130,0),\n0)","v":0},null,null,{"$f":"IFERROR(\nINDEX(OFFSET(P129,MATCH(\"\"&T129,P129:P$339,0),0):P$339,MATCH(\"*\",OFFSET(P129,MATCH(\"\"&T129,P129:P$339,0),0):P$339,0)),\n0)","v":0},{"$f":"IFERROR(\nINDEX(OFFSET(Q129,MATCH(\"\"&U129,Q129:Q$339,0),0):Q$339,MATCH(\"*\",OFFSET(Q129,MATCH(\"\"&U129,Q129:Q$339,0),0):Q$339,0)),\n0)","v":0}]
[null,null,"Serbia",null,"ManufacturingManufacture of basic metalsManufacture of tubes, pipes, hollow profiles and related fittings, of steel","24.2","Manufacturing","Manufacture of basic metals","Manufacture of tubes, pipes, hollow profiles and related fittings, of steel","High","High","High","t80","Drafted",null,{"$f":"IF($G131=Section,\nIF(COUNTIFS(P$22:P130,$H131)=0,$H131,0),\n0)","v":0},{"$f":"IF(AND($G131=Section,$H131=Category),\nIF(COUNTIFS(Q$22:Q130,$I131)=0,$I131,0),\n0)","v":0},null,null,{"$f":"IFERROR(\nINDEX(OFFSET(P130,MATCH(\"\"&T130,P130:P$339,0),0):P$339,MATCH(\"*\",OFFSET(P130,MATCH(\"\"&T130,P130:P$339,0),0):P$339,0)),\n0)","v":0},{"$f":"IFERROR(\nINDEX(OFFSET(Q130,MATCH(\"\"&U130,Q130:Q$339,0),0):Q$339,MATCH(\"*\",OFFSET(Q130,MATCH(\"\"&U130,Q130:Q$339,0),0):Q$339,0)),\n0)","v":0}]
[null,null,"Seychelles",null,"ManufacturingManufacture of basic metalsManufacture of other products and first processing of steel","24.3","Manufacturing","Manufacture of basic metals","Manufacture of other products and first processing of steel","High","High","High","t80","Drafted",null,{"$f":"IF($G132=Section,\nIF(COUNTIFS(P$22:P131,$H132)=0,$H132,0),\n0)","v":0},{"$f":"IF(AND($G132=Section,$H132=Category),\nIF(COUNTIFS(Q$22:Q131,$I132)=0,$I132,0),\n0)","v":0},null,null,{"$f":"IFERROR(\nINDEX(OFFSET(P131,MATCH(\"\"&T131,P131:P$339,0),0):P$339,MATCH(\"*\",OFFSET(P131,MATCH(\"\"&T131,P131:P$339,0),0):P$339,0)),\n0)","v":0},{"$f":"IFERROR(\nINDEX(OFFSET(Q131,MATCH(\"\"&U131,Q131:Q$339,0),0):Q$339,MATCH(\"*\",OFFSET(Q131,MATCH(\"\"&U131,Q131:Q$339,0),0):Q$339,0)),\n0)","v":0}]
[null,null,"Sierra Leone",null,"ManufacturingManufacture of basic metalsManufacture of basic precious and other non-ferrous metals (e.g.aluminium, lead, zinc and tin, copper etc.","24.4","Manufacturing","Manufacture of basic metals","Manufacture of basic precious and other non-ferrous metals (e.g.aluminium, lead, zinc and tin, copper etc.","High","High","High","t70","Drafted",null,{"$f":"IF($G133=Section,\nIF(COUNTIFS(P$22:P132,$H133)=0,$H133,0),\n0)","v":0},{"$f":"IF(AND($G133=Section,$H133=Category),\nIF(COUNTIFS(Q$22:Q132,$I133)=0,$I133,0),\n0)","v":0},null,null,{"$f":"IFERROR(\nINDEX(OFFSET(P132,MATCH(\"\"&T132,P132:P$339,0),0):P$339,MATCH(\"*\",OFFSET(P132,MATCH(\"\"&T132,P132:P$339,0),0):P$339,0)),\n0)","v":0},{"$f":"IFERROR(\nINDEX(OFFSET(Q132,MATCH(\"\"&U132,Q132:Q$339,0),0):Q$339,MATCH(\"*\",OFFSET(Q132,MATCH(\"\"&U132,Q132:Q$339,0),0):Q$339,0)),\n0)","v":0}]
[null,null,"Slovakia",null,"ManufacturingManufacture of basic metalsCasting of metals (iron, steel, light metals, non-ferrous metals)","24.5","Manufacturing","Manufacture of basic metals","Casting of metals (iron, steel, light metals, non-ferrous metals)","High","High","High","t80","Drafted",null,{"$f":"IF($G134=Section,\nIF(COUNTIFS(P$22:P133,$H134)=0,$H134,0),\n0)","v":0},{"$f":"IF(AND($G134=Section,$H134=Category),\nIF(COUNTIFS(Q$22:Q133,$I134)=0,$I134,0),\n0)","v":0},null,null,{"$f":"IFERROR(\nINDEX(OFFSET(#REF!,MATCH(\"\"&#REF!,P134:P$339,0),0):P$339,MATCH(\"*\",OFFSET(#REF!,MATCH(\"\"&#REF!,P134:P$339,0),0):P$339,0)),\n0)","v":0},{"$f":"IFERROR(\nINDEX(OFFSET(#REF!,MATCH(\"\"&#REF!,Q134:Q$339,0),0):Q$339,MATCH(\"*\",OFFSET(#REF!,MATCH(\"\"&#REF!,Q134:Q$339,0),0):Q$339,0)),\n0)","v":0}]
[null,null,"Slovenia",null,"ManufacturingManufacture of fabricated metal products, except machinery and equipmentManufacture of structural metal products","25.1","Manufacturing","Manufacture of fabricated metal products, except machinery and equipment","Manufacture of structural metal products","Low","Medium","Medium","t71","Drafted",null,{"$f":"IF($G135=Section,\nIF(COUNTIFS(P$22:P134,$H135)=0,$H135,0),\n0)","v":0},{"$f":"IF(AND($G135=Section,$H135=Category),\nIF(COUNTIFS(Q$22:Q134,$I135)=0,$I135,0),\n0)","v":0},null,null,{"$f":"IFERROR(\nINDEX(OFFSET(P134,MATCH(\"\"&T134,P134:P$339,0),0):P$339,MATCH(\"*\",OFFSET(P134,MATCH(\"\"&T134,P134:P$339,0),0):P$339,0)),\n0)","v":0},{"$f":"IFERROR(\nINDEX(OFFSET(Q134,MATCH(\"\"&U134,Q134:Q$339,0),0):Q$339,MATCH(\"*\",OFFSET(Q134,MATCH(\"\"&U134,Q134:Q$339,0),0):Q$339,0)),\n0)","v":0}]
[null,null,"Somalia",null,"ManufacturingManufacture of fabricated metal products, except machinery and equipmentManufacture of tanks, reservoirs and containers of metal (e.g. central heating radiators and boilers, etc.)","25.2","Manufacturing","Manufacture of fabricated metal products, except machinery and equipment","Manufacture of tanks, reservoirs and containers of metal (e.g. central heating radiators and boilers, etc.)","Low","Medium","Medium","t71","Drafted",null,{"$f":"IF($G136=Section,\nIF(COUNTIFS(P$22:P135,$H136)=0,$H136,0),\n0)","v":0},{"$f":"IF(AND($G136=Section,$H136=Category),\nIF(COUNTIFS(Q$22:Q135,$I136)=0,$I136,0),\n0)","v":0},null,null,{"$f":"IFERROR(\nINDEX(OFFSET(P135,MATCH(\"\"&T135,P135:P$339,0),0):P$339,MATCH(\"*\",OFFSET(P135,MATCH(\"\"&T135,P135:P$339,0),0):P$339,0)),\n0)","v":0},{"$f":"IFERROR(\nINDEX(OFFSET(Q135,MATCH(\"\"&U135,Q135:Q$339,0),0):Q$339,MATCH(\"*\",OFFSET(Q135,MATCH(\"\"&U135,Q135:Q$339,0),0):Q$339,0)),\n0)","v":0}]
[null,null,"South Africa",null,"ManufacturingManufacture of fabricated metal products, except machinery and equipmentManufacture of steam generators, except central heating hot water boilers","25.3","Manufacturing","Manufacture of fabricated metal products, except machinery and equipment","Manufacture of steam generators, except central heating hot water boilers","Low","Medium","Medium","t130","Not yet drafted",null,{"$f":"IF($G137=Section,\nIF(COUNTIFS(P$22:P136,$H137)=0,$H137,0),\n0)","v":0},{"$f":"IF(AND($G137=Section,$H137=Category),\nIF(COUNTIFS(Q$22:Q136,$I137)=0,$I137,0),\n0)","v":0},null,null,{"$f":"IFERROR(\nINDEX(OFFSET(P136,MATCH(\"\"&T136,P136:P$339,0),0):P$339,MATCH(\"*\",OFFSET(P136,MATCH(\"\"&T136,P136:P$339,0),0):P$339,0)),\n0)","v":0},{"$f":"IFERROR(\nINDEX(OFFSET(Q136,MATCH(\"\"&U136,Q136:Q$339,0),0):Q$339,MATCH(\"*\",OFFSET(Q136,MATCH(\"\"&U136,Q136:Q$339,0),0):Q$339,0)),\n0)","v":0}]
[null,null,"Spain",null,"ManufacturingManufacture of fabricated metal products, except machinery and equipmentManufacture of weapons and ammunition","25.4","Manufacturing","Manufacture of fabricated metal products, except machinery and equipment","Manufacture of weapons and ammunition","Excluded","Excluded","Excluded","[n/a]","[n/a]",null,{"$f":"IF($G138=Section,\nIF(COUNTIFS(P$22:P137,$H138)=0,$H138,0),\n0)","v":0},{"$f":"IF(AND($G138=Section,$H138=Category),\nIF(COUNTIFS(Q$22:Q137,$I138)=0,$I138,0),\n0)","v":0},null,null,{"$f":"IFERROR(\nINDEX(OFFSET(P137,MATCH(\"\"&T137,P137:P$339,0),0):P$339,MATCH(\"*\",OFFSET(P137,MATCH(\"\"&T137,P137:P$339,0),0):P$339,0)),\n0)","v":0},{"$f":"IFERROR(\nINDEX(OFFSET(Q137,MATCH(\"\"&U137,Q137:Q$339,0),0):Q$339,MATCH(\"*\",OFFSET(Q137,MATCH(\"\"&U137,Q137:Q$339,0),0):Q$339,0)),\n0)","v":0}]
[null,null,"Sudan",null,"ManufacturingManufacture of fabricated metal products, except machinery and equipmentForging, pressing, stamping and roll-forming of metal; powder metallurgy","25.5","Manufacturing","Manufacture of fabricated metal products, except machinery and equipment","Forging, pressing, stamping and roll-forming of metal; powder metallurgy","Medium","Medium","Medium","t71","Drafted",null,{"$f":"IF($G139=Section,\nIF(COUNTIFS(P$22:P138,$H139)=0,$H139,0),\n0)","v":0},{"$f":"IF(AND($G139=Section,$H139=Category),\nIF(COUNTIFS(Q$22:Q138,$I139)=0,$I139,0),\n0)","v":0},null,null,{"$f":"IFERROR(\nINDEX(OFFSET(P138,MATCH(\"\"&T138,P138:P$339,0),0):P$339,MATCH(\"*\",OFFSET(P138,MATCH(\"\"&T138,P138:P$339,0),0):P$339,0)),\n0)","v":0},{"$f":"IFERROR(\nINDEX(OFFSET(Q138,MATCH(\"\"&U138,Q138:Q$339,0),0):Q$339,MATCH(\"*\",OFFSET(Q138,MATCH(\"\"&U138,Q138:Q$339,0),0):Q$339,0)),\n0)","v":0}]
[null,null,"Svalbard",null,"ManufacturingManufacture of fabricated metal products, except machinery and equipmentTreatment and coating of metals","25.61","Manufacturing","Manufacture of fabricated metal products, except machinery and equipment","Treatment and coating of metals","High","High","High","t72","Drafted",null,{"$f":"IF($G140=Section,\nIF(COUNTIFS(P$22:P139,$H140)=0,$H140,0),\n0)","v":0},{"$f":"IF(AND($G140=Section,$H140=Category),\nIF(COUNTIFS(Q$22:Q139,$I140)=0,$I140,0),\n0)","v":0},null,null,{"$f":"IFERROR(\nINDEX(OFFSET(P139,MATCH(\"\"&T139,P139:P$339,0),0):P$339,MATCH(\"*\",OFFSET(P139,MATCH(\"\"&T139,P139:P$339,0),0):P$339,0)),\n0)","v":0},{"$f":"IFERROR(\nINDEX(OFFSET(Q139,MATCH(\"\"&U139,Q139:Q$339,0),0):Q$339,MATCH(\"*\",OFFSET(Q139,MATCH(\"\"&U139,Q139:Q$339,0),0):Q$339,0)),\n0)","v":0}]
[null,null,"Swaziland",null,"ManufacturingManufacture of fabricated metal products, except machinery and equipmentMachining, incl. boring, milling, planing, sawing, grinding, sharpening, polishing, welding, splicing etc.","25.62","Manufacturing","Manufacture of fabricated metal products, except machinery and equipment","Machining, incl. boring, milling, planing, sawing, grinding, sharpening, polishing, welding, splicing etc.","Low","Medium","Medium","t71","Drafted",null,{"$f":"IF($G141=Section,\nIF(COUNTIFS(P$22:P140,$H141)=0,$H141,0),\n0)","v":0},{"$f":"IF(AND($G141=Section,$H141=Category),\nIF(COUNTIFS(Q$22:Q140,$I141)=0,$I141,0),\n0)","v":0},null,null,{"$f":"IFERROR(\nINDEX(OFFSET(P140,MATCH(\"\"&T140,P140:P$339,0),0):P$339,MATCH(\"*\",OFFSET(P140,MATCH(\"\"&T140,P140:P$339,0),0):P$339,0)),\n0)","v":0},{"$f":"IFERROR(\nINDEX(OFFSET(Q140,MATCH(\"\"&U140,Q140:Q$339,0),0):Q$339,MATCH(\"*\",OFFSET(Q140,MATCH(\"\"&U140,Q140:Q$339,0),0):Q$339,0)),\n0)","v":0}]
[null,null,"Sweden",null,"ManufacturingManufacture of fabricated metal products, except machinery and equipmentManufacture of cutlery","25.71","Manufacturing","Manufacture of fabricated metal products, except machinery and equipment","Manufacture of cutlery","Medium","Medium","Medium","t31","Not yet drafted",null,{"$f":"IF($G142=Section,\nIF(COUNTIFS(P$22:P141,$H142)=0,$H142,0),\n0)","v":0},{"$f":"IF(AND($G142=Section,$H142=Category),\nIF(COUNTIFS(Q$22:Q141,$I142)=0,$I142,0),\n0)","v":0},null,null,{"$f":"IFERROR(\nINDEX(OFFSET(P141,MATCH(\"\"&T141,P141:P$339,0),0):P$339,MATCH(\"*\",OFFSET(P141,MATCH(\"\"&T141,P141:P$339,0),0):P$339,0)),\n0)","v":0},{"$f":"IFERROR(\nINDEX(OFFSET(Q141,MATCH(\"\"&U141,Q141:Q$339,0),0):Q$339,MATCH(\"*\",OFFSET(Q141,MATCH(\"\"&U141,Q141:Q$339,0),0):Q$339,0)),\n0)","v":0}]
[null,null,"Switzerland",null,"ManufacturingManufacture of fabricated metal products, except machinery and equipmentManufacture of locks and hinges","25.72","Manufacturing","Manufacture of fabricated metal products, except machinery and equipment","Manufacture of locks and hinges","Medium","Medium","Medium","t71","Drafted",null,{"$f":"IF($G143=Section,\nIF(COUNTIFS(P$22:P142,$H143)=0,$H143,0),\n0)","v":0},{"$f":"IF(AND($G143=Section,$H143=Category),\nIF(COUNTIFS(Q$22:Q142,$I143)=0,$I143,0),\n0)","v":0},null,null,{"$f":"IFERROR(\nINDEX(OFFSET(P142,MATCH(\"\"&T142,P142:P$339,0),0):P$339,MATCH(\"*\",OFFSET(P142,MATCH(\"\"&T142,P142:P$339,0),0):P$339,0)),\n0)","v":0},{"$f":"IFERROR(\nINDEX(OFFSET(Q142,MATCH(\"\"&U142,Q142:Q$339,0),0):Q$339,MATCH(\"*\",OFFSET(Q142,MATCH(\"\"&U142,Q142:Q$339,0),0):Q$339,0)),\n0)","v":0}]
[null,null,"Syria",null,"ManufacturingManufacture of fabricated metal products, except machinery and equipmentManufacture of tools","25.73","Manufacturing","Manufacture of fabricated metal products, except machinery and equipment","Manufacture of tools","Medium","Medium","Medium","t71","Drafted",null,{"$f":"IF($G144=Section,\nIF(COUNTIFS(P$22:P143,$H144)=0,$H144,0),\n0)","v":0},{"$f":"IF(AND($G144=Section,$H144=Category),\nIF(COUNTIFS(Q$22:Q143,$I144)=0,$I144,0),\n0)","v":0},null,null,{"$f":"IFERROR(\nINDEX(OFFSET(P143,MATCH(\"\"&T143,P143:P$339,0),0):P$339,MATCH(\"*\",OFFSET(P143,MATCH(\"\"&T143,P143:P$339,0),0):P$339,0)),\n0)","v":0},{"$f":"IFERROR(\nINDEX(OFFSET(Q143,MATCH(\"\"&U143,Q143:Q$339,0),0):Q$339,MATCH(\"*\",OFFSET(Q143,MATCH(\"\"&U143,Q143:Q$339,0),0):Q$339,0)),\n0)","v":0}]
[null,null,"Tanzania",null,"ManufacturingManufacture of fabricated metal products, except machinery and equipmentManufacture of other fabricated metal products","25.9","Manufacturing","Manufacture of fabricated metal products, except machinery and equipment","Manufacture of other fabricated metal products","Medium","Medium","Medium","t71","Drafted",null,{"$f":"IF($G145=Section,\nIF(COUNTIFS(P$22:P144,$H145)=0,$H145,0),\n0)","v":0},{"$f":"IF(AND($G145=Section,$H145=Category),\nIF(COUNTIFS(Q$22:Q144,$I145)=0,$I145,0),\n0)","v":0},null,null,{"$f":"IFERROR(\nINDEX(OFFSET(P144,MATCH(\"\"&T144,P144:P$339,0),0):P$339,MATCH(\"*\",OFFSET(P144,MATCH(\"\"&T144,P144:P$339,0),0):P$339,0)),\n0)","v":0},{"$f":"IFERROR(\nINDEX(OFFSET(Q144,MATCH(\"\"&U144,Q144:Q$339,0),0):Q$339,MATCH(\"*\",OFFSET(Q144,MATCH(\"\"&U144,Q144:Q$339,0),0):Q$339,0)),\n0)","v":0}]
[null,null,"Togo",null,"ManufacturingManufacture of computer, electronic and optical productsManufacture of electronic components and boards","26.1","Manufacturing","Manufacture of computer, electronic and optical products","Manufacture of electronic components and boards","Medium","Low","Medium","t57","Not yet drafted",null,{"$f":"IF($G146=Section,\nIF(COUNTIFS(P$22:P145,$H146)=0,$H146,0),\n0)","v":0},{"$f":"IF(AND($G146=Section,$H146=Category),\nIF(COUNTIFS(Q$22:Q145,$I146)=0,$I146,0),\n0)","v":0},null,null,{"$f":"IFERROR(\nINDEX(OFFSET(P145,MATCH(\"\"&T145,P145:P$339,0),0):P$339,MATCH(\"*\",OFFSET(P145,MATCH(\"\"&T145,P145:P$339,0),0):P$339,0)),\n0)","v":0},{"$f":"IFERROR(\nINDEX(OFFSET(Q145,MATCH(\"\"&U145,Q145:Q$339,0),0):Q$339,MATCH(\"*\",OFFSET(Q145,MATCH(\"\"&U145,Q145:Q$339,0),0):Q$339,0)),\n0)","v":0}]
[null,null,"Tromelin Island",null,"ManufacturingManufacture of computer, electronic and optical productsManufacture of computers and peripheral equipment","26.2","Manufacturing","Manufacture of computer, electronic and optical products","Manufacture of computers and peripheral equipment","Medium","Low","Medium","t57","Not yet drafted",null,{"$f":"IF($G147=Section,\nIF(COUNTIFS(P$22:P146,$H147)=0,$H147,0),\n0)","v":0},{"$f":"IF(AND($G147=Section,$H147=Category),\nIF(COUNTIFS(Q$22:Q146,$I147)=0,$I147,0),\n0)","v":0},null,null,{"$f":"IFERROR(\nINDEX(OFFSET(P146,MATCH(\"\"&T146,P146:P$339,0),0):P$339,MATCH(\"*\",OFFSET(P146,MATCH(\"\"&T146,P146:P$339,0),0):P$339,0)),\n0)","v":0},{"$f":"IFERROR(\nINDEX(OFFSET(Q146,MATCH(\"\"&U146,Q146:Q$339,0),0):Q$339,MATCH(\"*\",OFFSET(Q146,MATCH(\"\"&U146,Q146:Q$339,0),0):Q$339,0)),\n0)","v":0}]
[null,null,"Tunisia",null,"ManufacturingManufacture of computer, electronic and optical productsManufacture of communication equipment","26.3","Manufacturing","Manufacture of computer, electronic and optical products","Manufacture of communication equipment","Medium","Low","Medium","t57","Not yet drafted",null,{"$f":"IF($G148=Section,\nIF(COUNTIFS(P$22:P147,$H148)=0,$H148,0),\n0)","v":0},{"$f":"IF(AND($G148=Section,$H148=Category),\nIF(COUNTIFS(Q$22:Q147,$I148)=0,$I148,0),\n0)","v":0},null,null,{"$f":"IFERROR(\nINDEX(OFFSET(P147,MATCH(\"\"&T147,P147:P$339,0),0):P$339,MATCH(\"*\",OFFSET(P147,MATCH(\"\"&T147,P147:P$339,0),0):P$339,0)),\n0)","v":0},{"$f":"IFERROR(\nINDEX(OFFSET(Q147,MATCH(\"\"&U147,Q147:Q$339,0),0):Q$339,MATCH(\"*\",OFFSET(Q147,MATCH(\"\"&U147,Q147:Q$339,0),0):Q$339,0)),\n0)","v":0}]
[null,null,"Turkey",null,"ManufacturingManufacture of computer, electronic and optical productsManufacture of consumer electronics","26.4","Manufacturing","Manufacture of computer, electronic and optical products","Manufacture of consumer electronics","Medium","Low","Medium","t56","Not yet drafted",null,{"$f":"IF($G149=Section,\nIF(COUNTIFS(P$22:P148,$H149)=0,$H149,0),\n0)","v":0},{"$f":"IF(AND($G149=Section,$H149=Category),\nIF(COUNTIFS(Q$22:Q148,$I149)=0,$I149,0),\n0)","v":0},null,null,{"$f":"IFERROR(\nINDEX(OFFSET(P148,MATCH(\"\"&T148,P148:P$339,0),0):P$339,MATCH(\"*\",OFFSET(P148,MATCH(\"\"&T148,P148:P$339,0),0):P$339,0)),\n0)","v":0},{"$f":"IFERROR(\nINDEX(OFFSET(Q148,MATCH(\"\"&U148,Q148:Q$339,0),0):Q$339,MATCH(\"*\",OFFSET(Q148,MATCH(\"\"&U148,Q148:Q$339,0),0):Q$339,0)),\n0)","v":0}]
[null,null,"Uganda",null,"ManufacturingManufacture of computer, electronic and optical productsManufacture of instruments and appliances for measuring, testing and navigation; watches and clocks","26.5","Manufacturing","Manufacture of computer, electronic and optical products","Manufacture of instruments and appliances for measuring, testing and navigation; watches and clocks","Medium","Low","Medium","t56","Not yet drafted",null,{"$f":"IF($G150=Section,\nIF(COUNTIFS(P$22:P149,$H150)=0,$H150,0),\n0)","v":0},{"$f":"IF(AND($G150=Section,$H150=Category),\nIF(COUNTIFS(Q$22:Q149,$I150)=0,$I150,0),\n0)","v":0},null,null,{"$f":"IFERROR(\nINDEX(OFFSET(P149,MATCH(\"\"&T149,P149:P$339,0),0):P$339,MATCH(\"*\",OFFSET(P149,MATCH(\"\"&T149,P149:P$339,0),0):P$339,0)),\n0)","v":0},{"$f":"IFERROR(\nINDEX(OFFSET(Q149,MATCH(\"\"&U149,Q149:Q$339,0),0):Q$339,MATCH(\"*\",OFFSET(Q149,MATCH(\"\"&U149,Q149:Q$339,0),0):Q$339,0)),\n0)","v":0}]
[null,null,"Ukraine",null,{"$f":"G151&H151&I151","v":"ManufacturingManufacture of computer, electronic and optical productsManufacture of irradiation, electromedical and electrotherapeutic equipment"},"26.6","Manufacturing","Manufacture of computer, electronic and optical products","Manufacture of irradiation, electromedical and electrotherapeutic equipment","Medium","Low","Medium","t56","Not yet drafted",null,{"$f":"IF($G151=Section,\nIF(COUNTIFS(P$22:P150,$H151)=0,$H151,0),\n0)","v":0},{"$f":"IF(AND($G151=Section,$H151=Category),\nIF(COUNTIFS(Q$22:Q150,$I151)=0,$I151,0),\n0)","v":0},null,null,{"$f":"IFERROR(\nINDEX(OFFSET(P150,MATCH(\"\"&T150,P150:P$339,0),0):P$339,MATCH(\"*\",OFFSET(P150,MATCH(\"\"&T150,P150:P$339,0),0):P$339,0)),\n0)","v":0},{"$f":"IFERROR(\nINDEX(OFFSET(Q150,MATCH(\"\"&U150,Q150:Q$339,0),0):Q$339,MATCH(\"*\",OFFSET(Q150,MATCH(\"\"&U150,Q150:Q$339,0),0):Q$339,0)),\n0)","v":0}]
[null,null,"United Arab Emirates",null,"ManufacturingManufacture of computer, electronic and optical productsManufacture of optical instruments and photographic equipment","26.7","Manufacturing","Manufacture of computer, electronic and optical products","Manufacture of optical instruments and photographic equipment","Medium","Low","Medium","t56","Not yet drafted",null,{"$f":"IF($G152=Section,\nIF(COUNTIFS(P$22:P151,$H152)=0,$H152,0),\n0)","v":0},{"$f":"IF(AND($G152=Section,$H152=Category),\nIF(COUNTIFS(Q$22:Q151,$I152)=0,$I152,0),\n0)","v":0},null,null,{"$f":"IFERROR(\nINDEX(OFFSET(P151,MATCH(\"\"&T151,P151:P$339,0),0):P$339,MATCH(\"*\",OFFSET(P151,MATCH(\"\"&T151,P151:P$339,0),0):P$339,0)),\n0)","v":0},{"$f":"IFERROR(\nINDEX(OFFSET(Q151,MATCH(\"\"&U151,Q151:Q$339,0),0):Q$339,MATCH(\"*\",OFFSET(Q151,MATCH(\"\"&U151,Q151:Q$339,0),0):Q$339,0)),\n0)","v":0}]
[null,null,"United Kingdom",null,"ManufacturingManufacture of computer, electronic and optical productsManufacture of magnetic and optical media","26.8","Manufacturing","Manufacture of computer, electronic and optical products","Manufacture of magnetic and optical media","Medium","Low","Medium","t56","Not yet drafted",null,{"$f":"IF($G153=Section,\nIF(COUNTIFS(P$22:P152,$H153)=0,$H153,0),\n0)","v":0},{"$f":"IF(AND($G153=Section,$H153=Category),\nIF(COUNTIFS(Q$22:Q152,$I153)=0,$I153,0),\n0)","v":0},null,null,{"$f":"IFERROR(\nINDEX(OFFSET(P152,MATCH(\"\"&T152,P152:P$339,0),0):P$339,MATCH(\"*\",OFFSET(P152,MATCH(\"\"&T152,P152:P$339,0),0):P$339,0)),\n0)","v":0},{"$f":"IFERROR(\nINDEX(OFFSET(Q152,MATCH(\"\"&U152,Q152:Q$339,0),0):Q$339,MATCH(\"*\",OFFSET(Q152,MATCH(\"\"&U152,Q152:Q$339,0),0):Q$339,0)),\n0)","v":0}]
[null,null,"West Bank",null,"ManufacturingManufacture of electrical equipmentManufacture of electric motors, generators, transformers and electricity distribution and control apparatus","27.1","Manufacturing","Manufacture of electrical equipment","Manufacture of electric motors, generators, transformers and electricity distribution and control apparatus","Medium","Medium","Medium","t105","Drafted",null,{"$f":"IF($G154=Section,\nIF(COUNTIFS(P$22:P153,$H154)=0,$H154,0),\n0)","v":0},{"$f":"IF(AND($G154=Section,$H154=Category),\nIF(COUNTIFS(Q$22:Q153,$I154)=0,$I154,0),\n0)","v":0},null,null,{"$f":"IFERROR(\nINDEX(OFFSET(P153,MATCH(\"\"&T153,P153:P$339,0),0):P$339,MATCH(\"*\",OFFSET(P153,MATCH(\"\"&T153,P153:P$339,0),0):P$339,0)),\n0)","v":0},{"$f":"IFERROR(\nINDEX(OFFSET(Q153,MATCH(\"\"&U153,Q153:Q$339,0),0):Q$339,MATCH(\"*\",OFFSET(Q153,MATCH(\"\"&U153,Q153:Q$339,0),0):Q$339,0)),\n0)","v":0}]
[null,null,"Western Sahara",null,"ManufacturingManufacture of electrical equipmentManufacture of batteries and accumulators","27.2","Manufacturing","Manufacture of electrical equipment","Manufacture of batteries and accumulators","High","Medium","High","t50","Not yet drafted",null,{"$f":"IF($G155=Section,\nIF(COUNTIFS(P$22:P154,$H155)=0,$H155,0),\n0)","v":0},{"$f":"IF(AND($G155=Section,$H155=Category),\nIF(COUNTIFS(Q$22:Q154,$I155)=0,$I155,0),\n0)","v":0},null,null,{"$f":"IFERROR(\nINDEX(OFFSET(P154,MATCH(\"\"&T154,P154:P$339,0),0):P$339,MATCH(\"*\",OFFSET(P154,MATCH(\"\"&T154,P154:P$339,0),0):P$339,0)),\n0)","v":0},{"$f":"IFERROR(\nINDEX(OFFSET(Q154,MATCH(\"\"&U154,Q154:Q$339,0),0):Q$339,MATCH(\"*\",OFFSET(Q154,MATCH(\"\"&U154,Q154:Q$339,0),0):Q$339,0)),\n0)","v":0}]
[null,null,"Yemen",null,"ManufacturingManufacture of electrical equipmentManufacture of wiring and wiring devices","27.3","Manufacturing","Manufacture of electrical equipment","Manufacture of wiring and wiring devices","Medium","Medium","Medium","t56","Not yet drafted",null,{"$f":"IF($G156=Section,\nIF(COUNTIFS(P$22:P155,$H156)=0,$H156,0),\n0)","v":0},{"$f":"IF(AND($G156=Section,$H156=Category),\nIF(COUNTIFS(Q$22:Q155,$I156)=0,$I156,0),\n0)","v":0},null,null,{"$f":"IFERROR(\nINDEX(OFFSET(P155,MATCH(\"\"&T155,P155:P$339,0),0):P$339,MATCH(\"*\",OFFSET(P155,MATCH(\"\"&T155,P155:P$339,0),0):P$339,0)),\n0)","v":0},{"$f":"IFERROR(\nINDEX(OFFSET(Q155,MATCH(\"\"&U155,Q155:Q$339,0),0):Q$339,MATCH(\"*\",OFFSET(Q155,MATCH(\"\"&U155,Q155:Q$339,0),0):Q$339,0)),\n0)","v":0}]
[null,null,"Zambia",null,"ManufacturingManufacture of electrical equipmentManufacture of electric lighting equipment","27.4","Manufacturing","Manufacture of electrical equipment","Manufacture of electric lighting equipment","Medium","Medium","Medium","t56","Not yet drafted",null,{"$f":"IF($G157=Section,\nIF(COUNTIFS(P$22:P156,$H157)=0,$H157,0),\n0)","v":0},{"$f":"IF(AND($G157=Section,$H157=Category),\nIF(COUNTIFS(Q$22:Q156,$I157)=0,$I157,0),\n0)","v":0},null,null,{"$f":"IFERROR(\nINDEX(OFFSET(P156,MATCH(\"\"&T156,P156:P$339,0),0):P$339,MATCH(\"*\",OFFSET(P156,MATCH(\"\"&T156,P156:P$339,0),0):P$339,0)),\n0)","v":0},{"$f":"IFERROR(\nINDEX(OFFSET(Q156,MATCH(\"\"&U156,Q156:Q$339,0),0):Q$339,MATCH(\"*\",OFFSET(Q156,MATCH(\"\"&U156,Q156:Q$339,0),0):Q$339,0)),\n0)","v":0}]
[null,null,"Zimbabwe",null,"ManufacturingManufacture of electrical equipmentManufacture of domestic appliances","27.5","Manufacturing","Manufacture of electrical equipment","Manufacture of domestic appliances","Medium","Medium","Medium","t56","Not yet drafted",null,{"$f":"IF($G158=Section,\nIF(COUNTIFS(P$22:P157,$H158)=0,$H158,0),\n0)","v":0},{"$f":"IF(AND($G158=Section,$H158=Category),\nIF(COUNTIFS(Q$22:Q157,$I158)=0,$I158,0),\n0)","v":0},null,null,{"$f":"IFERROR(\nINDEX(OFFSET(P157,MATCH(\"\"&T157,P157:P$339,0),0):P$339,MATCH(\"*\",OFFSET(P157,MATCH(\"\"&T157,P157:P$339,0),0):P$339,0)),\n0)","v":0},{"$f":"IFERROR(\nINDEX(OFFSET(Q157,MATCH(\"\"&U157,Q157:Q$339,0),0):Q$339,MATCH(\"*\",OFFSET(Q157,MATCH(\"\"&U157,Q157:Q$339,0),0):Q$339,0)),\n0)","v":0}]
[null,null,null,null,"ManufacturingManufacture of electrical equipmentManufacture of other electrical equipment","27.9","Manufacturing","Manufacture of electrical equipment","Manufacture of other electrical equipment","Medium","Medium","Medium","t56","Not yet drafted",null,{"$f":"IF($G159=Section,\nIF(COUNTIFS(P$22:P158,$H159)=0,$H159,0),\n0)","v":0},{"$f":"IF(AND($G159=Section,$H159=Category),\nIF(COUNTIFS(Q$22:Q158,$I159)=0,$I159,0),\n0)","v":0},null,null,{"$f":"IFERROR(\nINDEX(OFFSET(P158,MATCH(\"\"&T158,P158:P$339,0),0):P$339,MATCH(\"*\",OFFSET(P158,MATCH(\"\"&T158,P158:P$339,0),0):P$339,0)),\n0)","v":0},{"$f":"IFERROR(\nINDEX(OFFSET(Q158,MATCH(\"\"&U158,Q158:Q$339,0),0):Q$339,MATCH(\"*\",OFFSET(Q158,MATCH(\"\"&U158,Q158:Q$339,0),0):Q$339,0)),\n0)","v":0}]
[null,null,null,null,"ManufacturingManufacture of machinery and equipment not elsewhere classifiedManufacture of general – purpose machinery","28.1","Manufacturing","Manufacture of machinery and equipment not elsewhere classified","Manufacture of general – purpose machinery","Medium","Medium","Medium","t130","Not yet drafted",null,{"$f":"IF($G160=Section,\nIF(COUNTIFS(P$22:P159,$H160)=0,$H160,0),\n0)","v":0},{"$f":"IF(AND($G160=Section,$H160=Category),\nIF(COUNTIFS(Q$22:Q159,$I160)=0,$I160,0),\n0)","v":0},null,null,{"$f":"IFERROR(\nINDEX(OFFSET(P159,MATCH(\"\"&T159,P159:P$339,0),0):P$339,MATCH(\"*\",OFFSET(P159,MATCH(\"\"&T159,P159:P$339,0),0):P$339,0)),\n0)","v":0},{"$f":"IFERROR(\nINDEX(OFFSET(Q159,MATCH(\"\"&U159,Q159:Q$339,0),0):Q$339,MATCH(\"*\",OFFSET(Q159,MATCH(\"\"&U159,Q159:Q$339,0),0):Q$339,0)),\n0)","v":0}]
[null,null,null,null,"ManufacturingManufacture of machinery and equipment not elsewhere classifiedManufacture of ovens, furnaces and furnace burners","28.21","Manufacturing","Manufacture of machinery and equipment not elsewhere classified","Manufacture of ovens, furnaces and furnace burners","Medium","Medium","Medium","t130","Not yet drafted",null,{"$f":"IF($G161=Section,\nIF(COUNTIFS(P$22:P160,$H161)=0,$H161,0),\n0)","v":0},{"$f":"IF(AND($G161=Section,$H161=Category),\nIF(COUNTIFS(Q$22:Q160,$I161)=0,$I161,0),\n0)","v":0},null,null,{"$f":"IFERROR(\nINDEX(OFFSET(P160,MATCH(\"\"&T160,P160:P$339,0),0):P$339,MATCH(\"*\",OFFSET(P160,MATCH(\"\"&T160,P160:P$339,0),0):P$339,0)),\n0)","v":0},{"$f":"IFERROR(\nINDEX(OFFSET(Q160,MATCH(\"\"&U160,Q160:Q$339,0),0):Q$339,MATCH(\"*\",OFFSET(Q160,MATCH(\"\"&U160,Q160:Q$339,0),0):Q$339,0)),\n0)","v":0}]
[null,null,null,null,"ManufacturingManufacture of machinery and equipment not elsewhere classifiedManufacture of lifting and handling equipment","28.22","Manufacturing","Manufacture of machinery and equipment not elsewhere classified","Manufacture of lifting and handling equipment","Medium","Medium","Medium","t130","Not yet drafted",null,{"$f":"IF($G162=Section,\nIF(COUNTIFS(P$22:P161,$H162)=0,$H162,0),\n0)","v":0},{"$f":"IF(AND($G162=Section,$H162=Category),\nIF(COUNTIFS(Q$22:Q161,$I162)=0,$I162,0),\n0)","v":0},null,null,{"$f":"IFERROR(\nINDEX(OFFSET(P161,MATCH(\"\"&T161,P161:P$339,0),0):P$339,MATCH(\"*\",OFFSET(P161,MATCH(\"\"&T161,P161:P$339,0),0):P$339,0)),\n0)","v":0},{"$f":"IFERROR(\nINDEX(OFFSET(Q161,MATCH(\"\"&U161,Q161:Q$339,0),0):Q$339,MATCH(\"*\",OFFSET(Q161,MATCH(\"\"&U161,Q161:Q$339,0),0):Q$339,0)),\n0)","v":0}]
[null,null,null,null,"ManufacturingManufacture of machinery and equipment not elsewhere classifiedManufacture of office machinery and equipment (except computers and peripheral equipment)","28.23","Manufacturing","Manufacture of machinery and equipment not elsewhere classified","Manufacture of office machinery and equipment (except computers and peripheral equipment)","Medium","Medium","Medium","t24","Not yet drafted",null,{"$f":"IF($G163=Section,\nIF(COUNTIFS(P$22:P162,$H163)=0,$H163,0),\n0)","v":0},{"$f":"IF(AND($G163=Section,$H163=Category),\nIF(COUNTIFS(Q$22:Q162,$I163)=0,$I163,0),\n0)","v":0},null,null,{"$f":"IFERROR(\nINDEX(OFFSET(P162,MATCH(\"\"&T162,P162:P$339,0),0):P$339,MATCH(\"*\",OFFSET(P162,MATCH(\"\"&T162,P162:P$339,0),0):P$339,0)),\n0)","v":0},{"$f":"IFERROR(\nINDEX(OFFSET(Q162,MATCH(\"\"&U162,Q162:Q$339,0),0):Q$339,MATCH(\"*\",OFFSET(Q162,MATCH(\"\"&U162,Q162:Q$339,0),0):Q$339,0)),\n0)","v":0}]
[null,null,null,null,"ManufacturingManufacture of machinery and equipment not elsewhere classifiedManufacture of power-driven hand tools","28.24","Manufacturing","Manufacture of machinery and equipment not elsewhere classified","Manufacture of power-driven hand tools","Medium","Medium","Medium","t56","Not yet drafted",null,{"$f":"IF($G164=Section,\nIF(COUNTIFS(P$22:P163,$H164)=0,$H164,0),\n0)","v":0},{"$f":"IF(AND($G164=Section,$H164=Category),\nIF(COUNTIFS(Q$22:Q163,$I164)=0,$I164,0),\n0)","v":0},null,null,{"$f":"IFERROR(\nINDEX(OFFSET(P163,MATCH(\"\"&T163,P163:P$339,0),0):P$339,MATCH(\"*\",OFFSET(P163,MATCH(\"\"&T163,P163:P$339,0),0):P$339,0)),\n0)","v":0},{"$f":"IFERROR(\nINDEX(OFFSET(Q163,MATCH(\"\"&U163,Q163:Q$339,0),0):Q$339,MATCH(\"*\",OFFSET(Q163,MATCH(\"\"&U163,Q163:Q$339,0),0):Q$339,0)),\n0)","v":0}]
[null,null,null,null,"ManufacturingManufacture of machinery and equipment not elsewhere classifiedManufacture of non-domestic cooling and ventilation equipment","28.25","Manufacturing","Manufacture of machinery and equipment not elsewhere classified","Manufacture of non-domestic cooling and ventilation equipment","Medium","Medium","Medium","t56","Not yet drafted",null,{"$f":"IF($G165=Section,\nIF(COUNTIFS(P$22:P164,$H165)=0,$H165,0),\n0)","v":0},{"$f":"IF(AND($G165=Section,$H165=Category),\nIF(COUNTIFS(Q$22:Q164,$I165)=0,$I165,0),\n0)","v":0},null,null,{"$f":"IFERROR(\nINDEX(OFFSET(P164,MATCH(\"\"&T164,P164:P$339,0),0):P$339,MATCH(\"*\",OFFSET(P164,MATCH(\"\"&T164,P164:P$339,0),0):P$339,0)),\n0)","v":0},{"$f":"IFERROR(\nINDEX(OFFSET(Q164,MATCH(\"\"&U164,Q164:Q$339,0),0):Q$339,MATCH(\"*\",OFFSET(Q164,MATCH(\"\"&U164,Q164:Q$339,0),0):Q$339,0)),\n0)","v":0}]
[null,null,null,null,"ManufacturingManufacture of machinery and equipment not elsewhere classifiedManufacture of other general-purpose machinery not elsewhere classified","28.29","Manufacturing","Manufacture of machinery and equipment not elsewhere classified","Manufacture of other general-purpose machinery not elsewhere classified","Medium","Medium","Medium","t130","Not yet drafted",null,{"$f":"IF($G166=Section,\nIF(COUNTIFS(P$22:P165,$H166)=0,$H166,0),\n0)","v":0},{"$f":"IF(AND($G166=Section,$H166=Category),\nIF(COUNTIFS(Q$22:Q165,$I166)=0,$I166,0),\n0)","v":0},null,null,{"$f":"IFERROR(\nINDEX(OFFSET(P165,MATCH(\"\"&T165,P165:P$339,0),0):P$339,MATCH(\"*\",OFFSET(P165,MATCH(\"\"&T165,P165:P$339,0),0):P$339,0)),\n0)","v":0},{"$f":"IFERROR(\nINDEX(OFFSET(Q165,MATCH(\"\"&U165,Q165:Q$339,0),0):Q$339,MATCH(\"*\",OFFSET(Q165,MATCH(\"\"&U165,Q165:Q$339,0),0):Q$339,0)),\n0)","v":0}]
[null,null,null,null,"ManufacturingManufacture of machinery and equipment not elsewhere classifiedManufacture of agricultural forestry machinery","28.3","Manufacturing","Manufacture of machinery and equipment not elsewhere classified","Manufacture of agricultural forestry machinery","Medium","Medium","Medium","t130","Not yet drafted",null,{"$f":"IF($G167=Section,\nIF(COUNTIFS(P$22:P166,$H167)=0,$H167,0),\n0)","v":0},{"$f":"IF(AND($G167=Section,$H167=Category),\nIF(COUNTIFS(Q$22:Q166,$I167)=0,$I167,0),\n0)","v":0},null,null,{"$f":"IFERROR(\nINDEX(OFFSET(P166,MATCH(\"\"&T166,P166:P$339,0),0):P$339,MATCH(\"*\",OFFSET(P166,MATCH(\"\"&T166,P166:P$339,0),0):P$339,0)),\n0)","v":0},{"$f":"IFERROR(\nINDEX(OFFSET(Q166,MATCH(\"\"&U166,Q166:Q$339,0),0):Q$339,MATCH(\"*\",OFFSET(Q166,MATCH(\"\"&U166,Q166:Q$339,0),0):Q$339,0)),\n0)","v":0}]
[null,null,null,null,"ManufacturingManufacture of machinery and equipment not elsewhere classifiedManufacture of metal forming machinery and machine tools","28.4","Manufacturing","Manufacture of machinery and equipment not elsewhere classified","Manufacture of metal forming machinery and machine tools","Medium","Medium","Medium","t130","Not yet drafted",null,{"$f":"IF($G168=Section,\nIF(COUNTIFS(P$22:P167,$H168)=0,$H168,0),\n0)","v":0},{"$f":"IF(AND($G168=Section,$H168=Category),\nIF(COUNTIFS(Q$22:Q167,$I168)=0,$I168,0),\n0)","v":0},null,null,{"$f":"IFERROR(\nINDEX(OFFSET(P167,MATCH(\"\"&T167,P167:P$339,0),0):P$339,MATCH(\"*\",OFFSET(P167,MATCH(\"\"&T167,P167:P$339,0),0):P$339,0)),\n0)","v":0},{"$f":"IFERROR(\nINDEX(OFFSET(Q167,MATCH(\"\"&U167,Q167:Q$339,0),0):Q$339,MATCH(\"*\",OFFSET(Q167,MATCH(\"\"&U167,Q167:Q$339,0),0):Q$339,0)),\n0)","v":0}]
[null,null,null,null,"ManufacturingManufacture of machinery and equipment not elsewhere classifiedManufacture of other special purpose machinery","28.9","Manufacturing","Manufacture of machinery and equipment not elsewhere classified","Manufacture of other special purpose machinery","Medium","Medium","Medium","t130","Not yet drafted",null,{"$f":"IF($G169=Section,\nIF(COUNTIFS(P$22:P168,$H169)=0,$H169,0),\n0)","v":0},{"$f":"IF(AND($G169=Section,$H169=Category),\nIF(COUNTIFS(Q$22:Q168,$I169)=0,$I169,0),\n0)","v":0},null,null,{"$f":"IFERROR(\nINDEX(OFFSET(P168,MATCH(\"\"&T168,P168:P$339,0),0):P$339,MATCH(\"*\",OFFSET(P168,MATCH(\"\"&T168,P168:P$339,0),0):P$339,0)),\n0)","v":0},{"$f":"IFERROR(\nINDEX(OFFSET(Q168,MATCH(\"\"&U168,Q168:Q$339,0),0):Q$339,MATCH(\"*\",OFFSET(Q168,MATCH(\"\"&U168,Q168:Q$339,0),0):Q$339,0)),\n0)","v":0}]
[null,null,null,null,"ManufacturingManufacture of motor vehicles, trailers and semi-trailersManufacture of motor vehicles","29.1","Manufacturing","Manufacture of motor vehicles, trailers and semi-trailers","Manufacture of motor vehicles","Medium","Medium","Medium","t41","Not yet drafted",null,{"$f":"IF($G170=Section,\nIF(COUNTIFS(P$22:P169,$H170)=0,$H170,0),\n0)","v":0},{"$f":"IF(AND($G170=Section,$H170=Category),\nIF(COUNTIFS(Q$22:Q169,$I170)=0,$I170,0),\n0)","v":0},null,null,{"$f":"IFERROR(\nINDEX(OFFSET(P169,MATCH(\"\"&T169,P169:P$339,0),0):P$339,MATCH(\"*\",OFFSET(P169,MATCH(\"\"&T169,P169:P$339,0),0):P$339,0)),\n0)","v":0},{"$f":"IFERROR(\nINDEX(OFFSET(Q169,MATCH(\"\"&U169,Q169:Q$339,0),0):Q$339,MATCH(\"*\",OFFSET(Q169,MATCH(\"\"&U169,Q169:Q$339,0),0):Q$339,0)),\n0)","v":0}]
[null,null,null,null,"ManufacturingManufacture of motor vehicles, trailers and semi-trailersManufacture of bodies (coachwork) for motor vehicles; manufacture of trailers and semi-trailers","29.2","Manufacturing","Manufacture of motor vehicles, trailers and semi-trailers","Manufacture of bodies (coachwork) for motor vehicles; manufacture of trailers and semi-trailers","Medium","Medium","Medium","t88","Drafted",null,{"$f":"IF($G171=Section,\nIF(COUNTIFS(P$22:P170,$H171)=0,$H171,0),\n0)","v":0},{"$f":"IF(AND($G171=Section,$H171=Category),\nIF(COUNTIFS(Q$22:Q170,$I171)=0,$I171,0),\n0)","v":0},null,null,{"$f":"IFERROR(\nINDEX(OFFSET(P170,MATCH(\"\"&T170,P170:P$339,0),0):P$339,MATCH(\"*\",OFFSET(P170,MATCH(\"\"&T170,P170:P$339,0),0):P$339,0)),\n0)","v":0},{"$f":"IFERROR(\nINDEX(OFFSET(Q170,MATCH(\"\"&U170,Q170:Q$339,0),0):Q$339,MATCH(\"*\",OFFSET(Q170,MATCH(\"\"&U170,Q170:Q$339,0),0):Q$339,0)),\n0)","v":0}]
[null,null,null,null,"ManufacturingManufacture of motor vehicles, trailers and semi-trailersManufacture of parts and accessories for motor vehicles","29.3","Manufacturing","Manufacture of motor vehicles, trailers and semi-trailers","Manufacture of parts and accessories for motor vehicles","Medium","Medium","Medium","t88","Drafted",null,{"$f":"IF($G172=Section,\nIF(COUNTIFS(P$22:P171,$H172)=0,$H172,0),\n0)","v":0},{"$f":"IF(AND($G172=Section,$H172=Category),\nIF(COUNTIFS(Q$22:Q171,$I172)=0,$I172,0),\n0)","v":0},null,null,{"$f":"IFERROR(\nINDEX(OFFSET(P171,MATCH(\"\"&T171,P171:P$339,0),0):P$339,MATCH(\"*\",OFFSET(P171,MATCH(\"\"&T171,P171:P$339,0),0):P$339,0)),\n0)","v":0},{"$f":"IFERROR(\nINDEX(OFFSET(Q171,MATCH(\"\"&U171,Q171:Q$339,0),0):Q$339,MATCH(\"*\",OFFSET(Q171,MATCH(\"\"&U171,Q171:Q$339,0),0):Q$339,0)),\n0)","v":0}]
[null,null,null,null,"ManufacturingManufacture of other transport equipmentBuilding of ships and floating structures","30.11","Manufacturing","Manufacture of other transport equipment","Building of ships and floating structures","Medium","High","High","t116","Not yet drafted",null,{"$f":"IF($G173=Section,\nIF(COUNTIFS(P$22:P172,$H173)=0,$H173,0),\n0)","v":0},{"$f":"IF(AND($G173=Section,$H173=Category),\nIF(COUNTIFS(Q$22:Q172,$I173)=0,$I173,0),\n0)","v":0},null,null,{"$f":"IFERROR(\nINDEX(OFFSET(P172,MATCH(\"\"&T172,P172:P$339,0),0):P$339,MATCH(\"*\",OFFSET(P172,MATCH(\"\"&T172,P172:P$339,0),0):P$339,0)),\n0)","v":0},{"$f":"IFERROR(\nINDEX(OFFSET(Q172,MATCH(\"\"&U172,Q172:Q$339,0),0):Q$339,MATCH(\"*\",OFFSET(Q172,MATCH(\"\"&U172,Q172:Q$339,0),0):Q$339,0)),\n0)","v":0}]
[null,null,null,null,"ManufacturingManufacture of other transport equipmentBuilding of pleasure and sporting boats","30.12","Manufacturing","Manufacture of other transport equipment","Building of pleasure and sporting boats","Medium","Medium","Medium","t116","Not yet drafted",null,{"$f":"IF($G174=Section,\nIF(COUNTIFS(P$22:P173,$H174)=0,$H174,0),\n0)","v":0},{"$f":"IF(AND($G174=Section,$H174=Category),\nIF(COUNTIFS(Q$22:Q173,$I174)=0,$I174,0),\n0)","v":0},null,null,{"$f":"IFERROR(\nINDEX(OFFSET(P173,MATCH(\"\"&T173,P173:P$339,0),0):P$339,MATCH(\"*\",OFFSET(P173,MATCH(\"\"&T173,P173:P$339,0),0):P$339,0)),\n0)","v":0},{"$f":"IFERROR(\nINDEX(OFFSET(Q173,MATCH(\"\"&U173,Q173:Q$339,0),0):Q$339,MATCH(\"*\",OFFSET(Q173,MATCH(\"\"&U173,Q173:Q$339,0),0):Q$339,0)),\n0)","v":0}]
[null,null,null,null,"ManufacturingManufacture of other transport equipmentManufacture of railway locomotives and rolling stock","30.2","Manufacturing","Manufacture of other transport equipment","Manufacture of railway locomotives and rolling stock","Medium","Medium","Medium","t122","Not yet drafted",null,{"$f":"IF($G175=Section,\nIF(COUNTIFS(P$22:P174,$H175)=0,$H175,0),\n0)","v":0},{"$f":"IF(AND($G175=Section,$H175=Category),\nIF(COUNTIFS(Q$22:Q174,$I175)=0,$I175,0),\n0)","v":0},null,null,{"$f":"IFERROR(\nINDEX(OFFSET(P174,MATCH(\"\"&T174,P174:P$339,0),0):P$339,MATCH(\"*\",OFFSET(P174,MATCH(\"\"&T174,P174:P$339,0),0):P$339,0)),\n0)","v":0},{"$f":"IFERROR(\nINDEX(OFFSET(Q174,MATCH(\"\"&U174,Q174:Q$339,0),0):Q$339,MATCH(\"*\",OFFSET(Q174,MATCH(\"\"&U174,Q174:Q$339,0),0):Q$339,0)),\n0)","v":0}]
[null,null,null,null,"ManufacturingManufacture of other transport equipmentManufacture of air and spacecraft and related machinery","30.3","Manufacturing","Manufacture of other transport equipment","Manufacture of air and spacecraft and related machinery","Medium","Medium","Medium","t51","Not yet drafted",null,{"$f":"IF($G176=Section,\nIF(COUNTIFS(P$22:P175,$H176)=0,$H176,0),\n0)","v":0},{"$f":"IF(AND($G176=Section,$H176=Category),\nIF(COUNTIFS(Q$22:Q175,$I176)=0,$I176,0),\n0)","v":0},null,null,{"$f":"IFERROR(\nINDEX(OFFSET(P175,MATCH(\"\"&T175,P175:P$339,0),0):P$339,MATCH(\"*\",OFFSET(P175,MATCH(\"\"&T175,P175:P$339,0),0):P$339,0)),\n0)","v":0},{"$f":"IFERROR(\nINDEX(OFFSET(Q175,MATCH(\"\"&U175,Q175:Q$339,0),0):Q$339,MATCH(\"*\",OFFSET(Q175,MATCH(\"\"&U175,Q175:Q$339,0),0):Q$339,0)),\n0)","v":0}]
[null,null,null,null,"ManufacturingManufacture of other transport equipmentManufacture of military fighting vehicles, Intercontinental ballistic missiles (ICBM)","30.4","Manufacturing","Manufacture of other transport equipment","Manufacture of military fighting vehicles, Intercontinental ballistic missiles (ICBM)","Excluded","Excluded","Excluded","[n/a]","[n/a]",null,{"$f":"IF($G177=Section,\nIF(COUNTIFS(P$22:P176,$H177)=0,$H177,0),\n0)","v":0},{"$f":"IF(AND($G177=Section,$H177=Category),\nIF(COUNTIFS(Q$22:Q176,$I177)=0,$I177,0),\n0)","v":0},null,null,{"$f":"IFERROR(\nINDEX(OFFSET(P176,MATCH(\"\"&T176,P176:P$339,0),0):P$339,MATCH(\"*\",OFFSET(P176,MATCH(\"\"&T176,P176:P$339,0),0):P$339,0)),\n0)","v":0},{"$f":"IFERROR(\nINDEX(OFFSET(Q176,MATCH(\"\"&U176,Q176:Q$339,0),0):Q$339,MATCH(\"*\",OFFSET(Q176,MATCH(\"\"&U176,Q176:Q$339,0),0):Q$339,0)),\n0)","v":0}]
[null,null,null,null,"ManufacturingManufacture of other transport equipmentManufacture of transport equipment n.e.c. (e.g. motorcycles, bicycles and invalid carriages)","30.9","Manufacturing","Manufacture of other transport equipment","Manufacture of transport equipment n.e.c. (e.g. motorcycles, bicycles and invalid carriages)","Medium","Medium","Medium","t42","Not yet drafted",null,{"$f":"IF($G178=Section,\nIF(COUNTIFS(P$22:P177,$H178)=0,$H178,0),\n0)","v":0},{"$f":"IF(AND($G178=Section,$H178=Category),\nIF(COUNTIFS(Q$22:Q177,$I178)=0,$I178,0),\n0)","v":0},null,null,{"$f":"IFERROR(\nINDEX(OFFSET(P177,MATCH(\"\"&T177,P177:P$339,0),0):P$339,MATCH(\"*\",OFFSET(P177,MATCH(\"\"&T177,P177:P$339,0),0):P$339,0)),\n0)","v":0},{"$f":"IFERROR(\nINDEX(OFFSET(Q177,MATCH(\"\"&U177,Q177:Q$339,0),0):Q$339,MATCH(\"*\",OFFSET(Q177,MATCH(\"\"&U177,Q177:Q$339,0),0):Q$339,0)),\n0)","v":0}]
[null,null,null,null,"ManufacturingManufacture of furniture[n/a]","31","Manufacturing","Manufacture of furniture","[n/a]","Medium","Medium","Medium","t85","Drafted",null,{"$f":"IF($G179=Section,\nIF(COUNTIFS(P$22:P178,$H179)=0,$H179,0),\n0)","v":0},{"$f":"IF(AND($G179=Section,$H179=Category),\nIF(COUNTIFS(Q$22:Q178,$I179)=0,$I179,0),\n0)","v":0},null,null,{"$f":"IFERROR(\nINDEX(OFFSET(P178,MATCH(\"\"&T178,P178:P$339,0),0):P$339,MATCH(\"*\",OFFSET(P178,MATCH(\"\"&T178,P178:P$339,0),0):P$339,0)),\n0)","v":0},{"$f":"IFERROR(\nINDEX(OFFSET(Q178,MATCH(\"\"&U178,Q178:Q$339,0),0):Q$339,MATCH(\"*\",OFFSET(Q178,MATCH(\"\"&U178,Q178:Q$339,0),0):Q$339,0)),\n0)","v":0}]
[null,null,null,null,"ManufacturingOther ManufacturingManufacturing of jewellery, bijouteries and related articles","32.1","Manufacturing","Other Manufacturing","Manufacturing of jewellery, bijouteries and related articles","Medium","Medium","Medium","t26","Not yet drafted",null,{"$f":"IF($G180=Section,\nIF(COUNTIFS(P$22:P179,$H180)=0,$H180,0),\n0)","v":0},{"$f":"IF(AND($G180=Section,$H180=Category),\nIF(COUNTIFS(Q$22:Q179,$I180)=0,$I180,0),\n0)","v":0},null,null,{"$f":"IFERROR(\nINDEX(OFFSET(P179,MATCH(\"\"&T179,P179:P$339,0),0):P$339,MATCH(\"*\",OFFSET(P179,MATCH(\"\"&T179,P179:P$339,0),0):P$339,0)),\n0)","v":0},{"$f":"IFERROR(\nINDEX(OFFSET(Q179,MATCH(\"\"&U179,Q179:Q$339,0),0):Q$339,MATCH(\"*\",OFFSET(Q179,MATCH(\"\"&U179,Q179:Q$339,0),0):Q$339,0)),\n0)","v":0}]
[null,null,null,null,"ManufacturingOther ManufacturingManufacture of musical instruments","32.2","Manufacturing","Other Manufacturing","Manufacture of musical instruments","Medium","Medium","Medium","t29","Not yet drafted",null,{"$f":"IF($G181=Section,\nIF(COUNTIFS(P$22:P180,$H181)=0,$H181,0),\n0)","v":0},{"$f":"IF(AND($G181=Section,$H181=Category),\nIF(COUNTIFS(Q$22:Q180,$I181)=0,$I181,0),\n0)","v":0},null,null,{"$f":"IFERROR(\nINDEX(OFFSET(P180,MATCH(\"\"&T180,P180:P$339,0),0):P$339,MATCH(\"*\",OFFSET(P180,MATCH(\"\"&T180,P180:P$339,0),0):P$339,0)),\n0)","v":0},{"$f":"IFERROR(\nINDEX(OFFSET(Q180,MATCH(\"\"&U180,Q180:Q$339,0),0):Q$339,MATCH(\"*\",OFFSET(Q180,MATCH(\"\"&U180,Q180:Q$339,0),0):Q$339,0)),\n0)","v":0}]
[null,null,null,null,"ManufacturingOther ManufacturingManufacture of sports goods","32.3","Manufacturing","Other Manufacturing","Manufacture of sports goods","Medium","Medium","Medium","t30","Not yet drafted",null,{"$f":"IF($G182=Section,\nIF(COUNTIFS(P$22:P181,$H182)=0,$H182,0),\n0)","v":0},{"$f":"IF(AND($G182=Section,$H182=Category),\nIF(COUNTIFS(Q$22:Q181,$I182)=0,$I182,0),\n0)","v":0},null,null,{"$f":"IFERROR(\nINDEX(OFFSET(P181,MATCH(\"\"&T181,P181:P$339,0),0):P$339,MATCH(\"*\",OFFSET(P181,MATCH(\"\"&T181,P181:P$339,0),0):P$339,0)),\n0)","v":0},{"$f":"IFERROR(\nINDEX(OFFSET(Q181,MATCH(\"\"&U181,Q181:Q$339,0),0):Q$339,MATCH(\"*\",OFFSET(Q181,MATCH(\"\"&U181,Q181:Q$339,0),0):Q$339,0)),\n0)","v":0}]
[null,null,null,null,"ManufacturingOther ManufacturingManufacture of games and toys","32.4","Manufacturing","Other Manufacturing","Manufacture of games and toys","Medium","Medium","Medium","t27","Not yet drafted",null,{"$f":"IF($G183=Section,\nIF(COUNTIFS(P$22:P182,$H183)=0,$H183,0),\n0)","v":0},{"$f":"IF(AND($G183=Section,$H183=Category),\nIF(COUNTIFS(Q$22:Q182,$I183)=0,$I183,0),\n0)","v":0},null,null,{"$f":"IFERROR(\nINDEX(OFFSET(P182,MATCH(\"\"&T182,P182:P$339,0),0):P$339,MATCH(\"*\",OFFSET(P182,MATCH(\"\"&T182,P182:P$339,0),0):P$339,0)),\n0)","v":0},{"$f":"IFERROR(\nINDEX(OFFSET(Q182,MATCH(\"\"&U182,Q182:Q$339,0),0):Q$339,MATCH(\"*\",OFFSET(Q182,MATCH(\"\"&U182,Q182:Q$339,0),0):Q$339,0)),\n0)","v":0}]
[null,null,null,null,"ManufacturingOther ManufacturingManufacture of medical and dental instruments and supplies","32.5","Manufacturing","Other Manufacturing","Manufacture of medical and dental instruments and supplies","Medium","Medium","Medium","t59","Not yet drafted",null,{"$f":"IF($G184=Section,\nIF(COUNTIFS(P$22:P183,$H184)=0,$H184,0),\n0)","v":0},{"$f":"IF(AND($G184=Section,$H184=Category),\nIF(COUNTIFS(Q$22:Q183,$I184)=0,$I184,0),\n0)","v":0},null,null,{"$f":"IFERROR(\nINDEX(OFFSET(P183,MATCH(\"\"&T183,P183:P$339,0),0):P$339,MATCH(\"*\",OFFSET(P183,MATCH(\"\"&T183,P183:P$339,0),0):P$339,0)),\n0)","v":0},{"$f":"IFERROR(\nINDEX(OFFSET(Q183,MATCH(\"\"&U183,Q183:Q$339,0),0):Q$339,MATCH(\"*\",OFFSET(Q183,MATCH(\"\"&U183,Q183:Q$339,0),0):Q$339,0)),\n0)","v":0}]
[null,null,null,null,"ManufacturingOther ManufacturingManufacturing n.e.c.","32.9","Manufacturing","Other Manufacturing","Manufacturing n.e.c.","Medium","Medium","Medium","t25","Not yet drafted",null,{"$f":"IF($G185=Section,\nIF(COUNTIFS(P$22:P184,$H185)=0,$H185,0),\n0)","v":0},{"$f":"IF(AND($G185=Section,$H185=Category),\nIF(COUNTIFS(Q$22:Q184,$I185)=0,$I185,0),\n0)","v":0},null,null,{"$f":"IFERROR(\nINDEX(OFFSET(P184,MATCH(\"\"&T184,P184:P$339,0),0):P$339,MATCH(\"*\",OFFSET(P184,MATCH(\"\"&T184,P184:P$339,0),0):P$339,0)),\n0)","v":0},{"$f":"IFERROR(\nINDEX(OFFSET(Q184,MATCH(\"\"&U184,Q184:Q$339,0),0):Q$339,MATCH(\"*\",OFFSET(Q184,MATCH(\"\"&U184,Q184:Q$339,0),0):Q$339,0)),\n0)","v":0}]
[null,null,null,null,"ManufacturingRepair and installation of machinery and equipmentRepair of fabricated metal products, machinery and equipment","33.1","Manufacturing","Repair and installation of machinery and equipment","Repair of fabricated metal products, machinery and equipment","Low","Medium","Medium","t56","Not yet drafted",null,{"$f":"IF($G186=Section,\nIF(COUNTIFS(P$22:P185,$H186)=0,$H186,0),\n0)","v":0},{"$f":"IF(AND($G186=Section,$H186=Category),\nIF(COUNTIFS(Q$22:Q185,$I186)=0,$I186,0),\n0)","v":0},null,null,{"$f":"IFERROR(\nINDEX(OFFSET(P185,MATCH(\"\"&T185,P185:P$339,0),0):P$339,MATCH(\"*\",OFFSET(P185,MATCH(\"\"&T185,P185:P$339,0),0):P$339,0)),\n0)","v":0},{"$f":"IFERROR(\nINDEX(OFFSET(Q185,MATCH(\"\"&U185,Q185:Q$339,0),0):Q$339,MATCH(\"*\",OFFSET(Q185,MATCH(\"\"&U185,Q185:Q$339,0),0):Q$339,0)),\n0)","v":0}]
[null,null,null,null,"ManufacturingRepair and installation of machinery and equipmentRepair of electrical equipment","33.14","Manufacturing","Repair and installation of machinery and equipment","Repair of electrical equipment","Low","Medium","Medium","t56","Not yet drafted",null,{"$f":"IF($G187=Section,\nIF(COUNTIFS(P$22:P186,$H187)=0,$H187,0),\n0)","v":0},{"$f":"IF(AND($G187=Section,$H187=Category),\nIF(COUNTIFS(Q$22:Q186,$I187)=0,$I187,0),\n0)","v":0},null,null,{"$f":"IFERROR(\nINDEX(OFFSET(P186,MATCH(\"\"&T186,P186:P$339,0),0):P$339,MATCH(\"*\",OFFSET(P186,MATCH(\"\"&T186,P186:P$339,0),0):P$339,0)),\n0)","v":0},{"$f":"IFERROR(\nINDEX(OFFSET(Q186,MATCH(\"\"&U186,Q186:Q$339,0),0):Q$339,MATCH(\"*\",OFFSET(Q186,MATCH(\"\"&U186,Q186:Q$339,0),0):Q$339,0)),\n0)","v":0}]
[null,null,null,null,"ManufacturingRepair and installation of machinery and equipmentRepair and maintenance of ships and boats","33.15","Manufacturing","Repair and installation of machinery and equipment","Repair and maintenance of ships and boats","Low","Medium","Medium","t116","Not yet drafted",null,{"$f":"IF($G188=Section,\nIF(COUNTIFS(P$22:P187,$H188)=0,$H188,0),\n0)","v":0},{"$f":"IF(AND($G188=Section,$H188=Category),\nIF(COUNTIFS(Q$22:Q187,$I188)=0,$I188,0),\n0)","v":0},null,null,{"$f":"IFERROR(\nINDEX(OFFSET(P187,MATCH(\"\"&T187,P187:P$339,0),0):P$339,MATCH(\"*\",OFFSET(P187,MATCH(\"\"&T187,P187:P$339,0),0):P$339,0)),\n0)","v":0},{"$f":"IFERROR(\nINDEX(OFFSET(Q187,MATCH(\"\"&U187,Q187:Q$339,0),0):Q$339,MATCH(\"*\",OFFSET(Q187,MATCH(\"\"&U187,Q187:Q$339,0),0):Q$339,0)),\n0)","v":0}]
[null,null,null,null,"ManufacturingRepair and installation of machinery and equipmentRepair and maintenance of aircraft and spacecraft","33.16","Manufacturing","Repair and installation of machinery and equipment","Repair and maintenance of aircraft and spacecraft","Low","Medium","Medium","t51","Not yet drafted",null,{"$f":"IF($G189=Section,\nIF(COUNTIFS(P$22:P188,$H189)=0,$H189,0),\n0)","v":0},{"$f":"IF(AND($G189=Section,$H189=Category),\nIF(COUNTIFS(Q$22:Q188,$I189)=0,$I189,0),\n0)","v":0},null,null,{"$f":"IFERROR(\nINDEX(OFFSET(P188,MATCH(\"\"&T188,P188:P$339,0),0):P$339,MATCH(\"*\",OFFSET(P188,MATCH(\"\"&T188,P188:P$339,0),0):P$339,0)),\n0)","v":0},{"$f":"IFERROR(\nINDEX(OFFSET(Q188,MATCH(\"\"&U188,Q188:Q$339,0),0):Q$339,MATCH(\"*\",OFFSET(Q188,MATCH(\"\"&U188,Q188:Q$339,0),0):Q$339,0)),\n0)","v":0}]
[null,null,null,null,"ManufacturingRepair and installation of machinery and equipmentRepair and maintenance of other transport equipment","33.17","Manufacturing","Repair and installation of machinery and equipment","Repair and maintenance of other transport equipment","Low","Medium","Medium","t39","Not yet drafted",null,{"$f":"IF($G190=Section,\nIF(COUNTIFS(P$22:P189,$H190)=0,$H190,0),\n0)","v":0},{"$f":"IF(AND($G190=Section,$H190=Category),\nIF(COUNTIFS(Q$22:Q189,$I190)=0,$I190,0),\n0)","v":0},null,null,{"$f":"IFERROR(\nINDEX(OFFSET(P189,MATCH(\"\"&T189,P189:P$339,0),0):P$339,MATCH(\"*\",OFFSET(P189,MATCH(\"\"&T189,P189:P$339,0),0):P$339,0)),\n0)","v":0},{"$f":"IFERROR(\nINDEX(OFFSET(Q189,MATCH(\"\"&U189,Q189:Q$339,0),0):Q$339,MATCH(\"*\",OFFSET(Q189,MATCH(\"\"&U189,Q189:Q$339,0),0):Q$339,0)),\n0)","v":0}]
[null,null,null,null,"ManufacturingRepair and installation of machinery and equipmentInstallation of industrial machinery and equipment","33.2","Manufacturing","Repair and installation of machinery and equipment","Installation of industrial machinery and equipment","Low","Medium","Medium","t130","Not yet drafted",null,{"$f":"IF($G191=Section,\nIF(COUNTIFS(P$22:P190,$H191)=0,$H191,0),\n0)","v":0},{"$f":"IF(AND($G191=Section,$H191=Category),\nIF(COUNTIFS(Q$22:Q190,$I191)=0,$I191,0),\n0)","v":0},null,null,{"$f":"IFERROR(\nINDEX(OFFSET(P190,MATCH(\"\"&T190,P190:P$339,0),0):P$339,MATCH(\"*\",OFFSET(P190,MATCH(\"\"&T190,P190:P$339,0),0):P$339,0)),\n0)","v":0},{"$f":"IFERROR(\nINDEX(OFFSET(Q190,MATCH(\"\"&U190,Q190:Q$339,0),0):Q$339,MATCH(\"*\",OFFSET(Q190,MATCH(\"\"&U190,Q190:Q$339,0),0):Q$339,0)),\n0)","v":0}]
[null,null,null,null,"Electricity, gas steam and air conditioning supplyElectricity, gas steam and air conditioning supplyElectric power generations, transmission and distribution","35.1","Electricity, gas steam and air conditioning supply","Electricity, gas steam and air conditioning supply","Electric power generations, transmission and distribution","High","High","High","t105","Drafted",null,{"$f":"IF($G192=Section,\nIF(COUNTIFS(P$22:P191,$H192)=0,$H192,0),\n0)","v":0},{"$f":"IF(AND($G192=Section,$H192=Category),\nIF(COUNTIFS(Q$22:Q191,$I192)=0,$I192,0),\n0)","v":0},null,null,{"$f":"IFERROR(\nINDEX(OFFSET(P191,MATCH(\"\"&T191,P191:P$339,0),0):P$339,MATCH(\"*\",OFFSET(P191,MATCH(\"\"&T191,P191:P$339,0),0):P$339,0)),\n0)","v":0},{"$f":"IFERROR(\nINDEX(OFFSET(Q191,MATCH(\"\"&U191,Q191:Q$339,0),0):Q$339,MATCH(\"*\",OFFSET(Q191,MATCH(\"\"&U191,Q191:Q$339,0),0):Q$339,0)),\n0)","v":0}]
[null,null,null,null,"Electricity, gas steam and air conditioning supplyElectricity, gas steam and air conditioning supplyProduction of electricity","35.11","Electricity, gas steam and air conditioning supply","Electricity, gas steam and air conditioning supply","Production of electricity","High","High","High","t105","Drafted",null,{"$f":"IF($G193=Section,\nIF(COUNTIFS(P$22:P192,$H193)=0,$H193,0),\n0)","v":0},{"$f":"IF(AND($G193=Section,$H193=Category),\nIF(COUNTIFS(Q$22:Q192,$I193)=0,$I193,0),\n0)","v":0},null,null,{"$f":"IFERROR(\nINDEX(OFFSET(P192,MATCH(\"\"&T192,P192:P$339,0),0):P$339,MATCH(\"*\",OFFSET(P192,MATCH(\"\"&T192,P192:P$339,0),0):P$339,0)),\n0)","v":0},{"$f":"IFERROR(\nINDEX(OFFSET(Q192,MATCH(\"\"&U192,Q192:Q$339,0),0):Q$339,MATCH(\"*\",OFFSET(Q192,MATCH(\"\"&U192,Q192:Q$339,0),0):Q$339,0)),\n0)","v":0}]
[null,null,null,null,"Electricity, gas steam and air conditioning supplyElectricity, gas steam and air conditioning supplyTransmission of electricity","35.12","Electricity, gas steam and air conditioning supply","Electricity, gas steam and air conditioning supply","Transmission of electricity","Low","High","High","t105","Drafted",null,{"$f":"IF($G194=Section,\nIF(COUNTIFS(P$22:P193,$H194)=0,$H194,0),\n0)","v":0},{"$f":"IF(AND($G194=Section,$H194=Category),\nIF(COUNTIFS(Q$22:Q193,$I194)=0,$I194,0),\n0)","v":0},null,null,{"$f":"IFERROR(\nINDEX(OFFSET(P193,MATCH(\"\"&T193,P193:P$339,0),0):P$339,MATCH(\"*\",OFFSET(P193,MATCH(\"\"&T193,P193:P$339,0),0):P$339,0)),\n0)","v":0},{"$f":"IFERROR(\nINDEX(OFFSET(Q193,MATCH(\"\"&U193,Q193:Q$339,0),0):Q$339,MATCH(\"*\",OFFSET(Q193,MATCH(\"\"&U193,Q193:Q$339,0),0):Q$339,0)),\n0)","v":0}]
[null,null,null,null,"Electricity, gas steam and air conditioning supplyElectricity, gas steam and air conditioning supplyDistribution of electricity","35.13","Electricity, gas steam and air conditioning supply","Electricity, gas steam and air conditioning supply","Distribution of electricity","Low","High","High","t105","Drafted",null,{"$f":"IF($G195=Section,\nIF(COUNTIFS(P$22:P194,$H195)=0,$H195,0),\n0)","v":0},{"$f":"IF(AND($G195=Section,$H195=Category),\nIF(COUNTIFS(Q$22:Q194,$I195)=0,$I195,0),\n0)","v":0},null,null,{"$f":"IFERROR(\nINDEX(OFFSET(P194,MATCH(\"\"&T194,P194:P$339,0),0):P$339,MATCH(\"*\",OFFSET(P194,MATCH(\"\"&T194,P194:P$339,0),0):P$339,0)),\n0)","v":0},{"$f":"IFERROR(\nINDEX(OFFSET(Q194,MATCH(\"\"&U194,Q194:Q$339,0),0):Q$339,MATCH(\"*\",OFFSET(Q194,MATCH(\"\"&U194,Q194:Q$339,0),0):Q$339,0)),\n0)","v":0}]
[null,null,null,null,"Electricity, gas steam and air conditioning supplyElectricity, gas steam and air conditioning supplyTrade of electricity","35.14","Electricity, gas steam and air conditioning supply","Electricity, gas steam and air conditioning supply","Trade of electricity","Low","Low","Low","[n/a]","[n/a]",null,{"$f":"IF($G196=Section,\nIF(COUNTIFS(P$22:P195,$H196)=0,$H196,0),\n0)","v":0},{"$f":"IF(AND($G196=Section,$H196=Category),\nIF(COUNTIFS(Q$22:Q195,$I196)=0,$I196,0),\n0)","v":0},null,null,{"$f":"IFERROR(\nINDEX(OFFSET(P195,MATCH(\"\"&T195,P195:P$339,0),0):P$339,MATCH(\"*\",OFFSET(P195,MATCH(\"\"&T195,P195:P$339,0),0):P$339,0)),\n0)","v":0},{"$f":"IFERROR(\nINDEX(OFFSET(Q195,MATCH(\"\"&U195,Q195:Q$339,0),0):Q$339,MATCH(\"*\",OFFSET(Q195,MATCH(\"\"&U195,Q195:Q$339,0),0):Q$339,0)),\n0)","v":0}]
[null,null,null,null,"Electricity, gas steam and air conditioning supplyElectricity, gas steam and air conditioning supplyManufacture of gas; distribution of gaseous fuels through mains","35.2","Electricity, gas steam and air conditioning supply","Electricity, gas steam and air conditioning supply","Manufacture of gas; distribution of gaseous fuels through mains","High","High","High","t101","Drafted",null,{"$f":"IF($G197=Section,\nIF(COUNTIFS(P$22:P196,$H197)=0,$H197,0),\n0)","v":0},{"$f":"IF(AND($G197=Section,$H197=Category),\nIF(COUNTIFS(Q$22:Q196,$I197)=0,$I197,0),\n0)","v":0},null,null,{"$f":"IFERROR(\nINDEX(OFFSET(P196,MATCH(\"\"&T196,P196:P$339,0),0):P$339,MATCH(\"*\",OFFSET(P196,MATCH(\"\"&T196,P196:P$339,0),0):P$339,0)),\n0)","v":0},{"$f":"IFERROR(\nINDEX(OFFSET(Q196,MATCH(\"\"&U196,Q196:Q$339,0),0):Q$339,MATCH(\"*\",OFFSET(Q196,MATCH(\"\"&U196,Q196:Q$339,0),0):Q$339,0)),\n0)","v":0}]
[null,null,null,null,"Electricity, gas steam and air conditioning supplyElectricity, gas steam and air conditioning supplyManufacture of gas","35.21","Electricity, gas steam and air conditioning supply","Electricity, gas steam and air conditioning supply","Manufacture of gas","High","High","High","t47","Not yet drafted",null,{"$f":"IF($G198=Section,\nIF(COUNTIFS(P$22:P197,$H198)=0,$H198,0),\n0)","v":0},{"$f":"IF(AND($G198=Section,$H198=Category),\nIF(COUNTIFS(Q$22:Q197,$I198)=0,$I198,0),\n0)","v":0},null,null,{"$f":"IFERROR(\nINDEX(OFFSET(P197,MATCH(\"\"&T197,P197:P$339,0),0):P$339,MATCH(\"*\",OFFSET(P197,MATCH(\"\"&T197,P197:P$339,0),0):P$339,0)),\n0)","v":0},{"$f":"IFERROR(\nINDEX(OFFSET(Q197,MATCH(\"\"&U197,Q197:Q$339,0),0):Q$339,MATCH(\"*\",OFFSET(Q197,MATCH(\"\"&U197,Q197:Q$339,0),0):Q$339,0)),\n0)","v":0}]
[null,null,null,null,"Electricity, gas steam and air conditioning supplyElectricity, gas steam and air conditioning supplyDistribution of gaseous fuels through mains","35.22","Electricity, gas steam and air conditioning supply","Electricity, gas steam and air conditioning supply","Distribution of gaseous fuels through mains","Medium","Medium","Medium","t46","Not yet drafted",null,{"$f":"IF($G199=Section,\nIF(COUNTIFS(P$22:P198,$H199)=0,$H199,0),\n0)","v":0},{"$f":"IF(AND($G199=Section,$H199=Category),\nIF(COUNTIFS(Q$22:Q198,$I199)=0,$I199,0),\n0)","v":0},null,null,{"$f":"IFERROR(\nINDEX(OFFSET(P198,MATCH(\"\"&T198,P198:P$339,0),0):P$339,MATCH(\"*\",OFFSET(P198,MATCH(\"\"&T198,P198:P$339,0),0):P$339,0)),\n0)","v":0},{"$f":"IFERROR(\nINDEX(OFFSET(Q198,MATCH(\"\"&U198,Q198:Q$339,0),0):Q$339,MATCH(\"*\",OFFSET(Q198,MATCH(\"\"&U198,Q198:Q$339,0),0):Q$339,0)),\n0)","v":0}]
[null,null,null,null,"Electricity, gas steam and air conditioning supplyElectricity, gas steam and air conditioning supplyTrade of gas through mains","35.23","Electricity, gas steam and air conditioning supply","Electricity, gas steam and air conditioning supply","Trade of gas through mains","Low","Low","Low","[n/a]","[n/a]",null,{"$f":"IF($G200=Section,\nIF(COUNTIFS(P$22:P199,$H200)=0,$H200,0),\n0)","v":0},{"$f":"IF(AND($G200=Section,$H200=Category),\nIF(COUNTIFS(Q$22:Q199,$I200)=0,$I200,0),\n0)","v":0},null,null,{"$f":"IFERROR(\nINDEX(OFFSET(P199,MATCH(\"\"&T199,P199:P$339,0),0):P$339,MATCH(\"*\",OFFSET(P199,MATCH(\"\"&T199,P199:P$339,0),0):P$339,0)),\n0)","v":0},{"$f":"IFERROR(\nINDEX(OFFSET(Q199,MATCH(\"\"&U199,Q199:Q$339,0),0):Q$339,MATCH(\"*\",OFFSET(Q199,MATCH(\"\"&U199,Q199:Q$339,0),0):Q$339,0)),\n0)","v":0}]
[null,null,null,null,"Electricity, gas steam and air conditioning supplyElectricity, gas steam and air conditioning supplySteam and air conditioning supply","35.3","Electricity, gas steam and air conditioning supply","Electricity, gas steam and air conditioning supply","Steam and air conditioning supply","Medium","Medium","Medium","t19","Not yet drafted",null,{"$f":"IF($G201=Section,\nIF(COUNTIFS(P$22:P200,$H201)=0,$H201,0),\n0)","v":0},{"$f":"IF(AND($G201=Section,$H201=Category),\nIF(COUNTIFS(Q$22:Q200,$I201)=0,$I201,0),\n0)","v":0},null,null,{"$f":"IFERROR(\nINDEX(OFFSET(P200,MATCH(\"\"&T200,P200:P$339,0),0):P$339,MATCH(\"*\",OFFSET(P200,MATCH(\"\"&T200,P200:P$339,0),0):P$339,0)),\n0)","v":0},{"$f":"IFERROR(\nINDEX(OFFSET(Q200,MATCH(\"\"&U200,Q200:Q$339,0),0):Q$339,MATCH(\"*\",OFFSET(Q200,MATCH(\"\"&U200,Q200:Q$339,0),0):Q$339,0)),\n0)","v":0}]
[null,null,null,null,"Water supply (sewerage, waste management and remediation activities)Water collection, treatment and supply[n/a]","36","Water supply (sewerage, waste management and remediation activities)","Water collection, treatment and supply","[n/a]","Medium","Medium","Medium","t54","Not yet drafted",null,{"$f":"IF($G202=Section,\nIF(COUNTIFS(P$22:P201,$H202)=0,$H202,0),\n0)","v":0},{"$f":"IF(AND($G202=Section,$H202=Category),\nIF(COUNTIFS(Q$22:Q201,$I202)=0,$I202,0),\n0)","v":0},null,null,{"$f":"IFERROR(\nINDEX(OFFSET(P201,MATCH(\"\"&T201,P201:P$339,0),0):P$339,MATCH(\"*\",OFFSET(P201,MATCH(\"\"&T201,P201:P$339,0),0):P$339,0)),\n0)","v":0},{"$f":"IFERROR(\nINDEX(OFFSET(Q201,MATCH(\"\"&U201,Q201:Q$339,0),0):Q$339,MATCH(\"*\",OFFSET(Q201,MATCH(\"\"&U201,Q201:Q$339,0),0):Q$339,0)),\n0)","v":0}]
[null,null,null,null,"Water supply (sewerage, waste management and remediation activities)Sewerage[n/a]","37","Water supply (sewerage, waste management and remediation activities)","Sewerage","[n/a]","High","High","High","t55","Not yet drafted",null,{"$f":"IF($G203=Section,\nIF(COUNTIFS(P$22:P202,$H203)=0,$H203,0),\n0)","v":0},{"$f":"IF(AND($G203=Section,$H203=Category),\nIF(COUNTIFS(Q$22:Q202,$I203)=0,$I203,0),\n0)","v":0},null,null,{"$f":"IFERROR(\nINDEX(OFFSET(P202,MATCH(\"\"&T202,P202:P$339,0),0):P$339,MATCH(\"*\",OFFSET(P202,MATCH(\"\"&T202,P202:P$339,0),0):P$339,0)),\n0)","v":0},{"$f":"IFERROR(\nINDEX(OFFSET(Q202,MATCH(\"\"&U202,Q202:Q$339,0),0):Q$339,MATCH(\"*\",OFFSET(Q202,MATCH(\"\"&U202,Q202:Q$339,0),0):Q$339,0)),\n0)","v":0}]
[null,null,null,null,"Water supply (sewerage, waste management and remediation activities)Waste collection, treatment and disposal activities; materials recoveryCollection of non-hazardous waste","38.11","Water supply (sewerage, waste management and remediation activities)","Waste collection, treatment and disposal activities; materials recovery","Collection of non-hazardous waste","Medium","Medium","Medium","t54","Not yet drafted",null,{"$f":"IF($G204=Section,\nIF(COUNTIFS(P$22:P203,$H204)=0,$H204,0),\n0)","v":0},{"$f":"IF(AND($G204=Section,$H204=Category),\nIF(COUNTIFS(Q$22:Q203,$I204)=0,$I204,0),\n0)","v":0},null,null,{"$f":"IFERROR(\nINDEX(OFFSET(P203,MATCH(\"\"&T203,P203:P$339,0),0):P$339,MATCH(\"*\",OFFSET(P203,MATCH(\"\"&T203,P203:P$339,0),0):P$339,0)),\n0)","v":0},{"$f":"IFERROR(\nINDEX(OFFSET(Q203,MATCH(\"\"&U203,Q203:Q$339,0),0):Q$339,MATCH(\"*\",OFFSET(Q203,MATCH(\"\"&U203,Q203:Q$339,0),0):Q$339,0)),\n0)","v":0}]
[null,null,null,null,"Water supply (sewerage, waste management and remediation activities)Waste collection, treatment and disposal activities; materials recoveryCollection of hazardous waste","38.12","Water supply (sewerage, waste management and remediation activities)","Waste collection, treatment and disposal activities; materials recovery","Collection of hazardous waste","High","High","High","t54","Not yet drafted",null,{"$f":"IF($G205=Section,\nIF(COUNTIFS(P$22:P204,$H205)=0,$H205,0),\n0)","v":0},{"$f":"IF(AND($G205=Section,$H205=Category),\nIF(COUNTIFS(Q$22:Q204,$I205)=0,$I205,0),\n0)","v":0},null,null,{"$f":"IFERROR(\nINDEX(OFFSET(P204,MATCH(\"\"&T204,P204:P$339,0),0):P$339,MATCH(\"*\",OFFSET(P204,MATCH(\"\"&T204,P204:P$339,0),0):P$339,0)),\n0)","v":0},{"$f":"IFERROR(\nINDEX(OFFSET(Q204,MATCH(\"\"&U204,Q204:Q$339,0),0):Q$339,MATCH(\"*\",OFFSET(Q204,MATCH(\"\"&U204,Q204:Q$339,0),0):Q$339,0)),\n0)","v":0}]
[null,null,null,null,"Water supply (sewerage, waste management and remediation activities)Waste collection, treatment and disposal activities; materials recoveryTreatment and disposal of non-hazardous waste","38.21","Water supply (sewerage, waste management and remediation activities)","Waste collection, treatment and disposal activities; materials recovery","Treatment and disposal of non-hazardous waste","High","High","High","t54","Not yet drafted",null,{"$f":"IF($G206=Section,\nIF(COUNTIFS(P$22:P205,$H206)=0,$H206,0),\n0)","v":0},{"$f":"IF(AND($G206=Section,$H206=Category),\nIF(COUNTIFS(Q$22:Q205,$I206)=0,$I206,0),\n0)","v":0},null,null,{"$f":"IFERROR(\nINDEX(OFFSET(P205,MATCH(\"\"&T205,P205:P$339,0),0):P$339,MATCH(\"*\",OFFSET(P205,MATCH(\"\"&T205,P205:P$339,0),0):P$339,0)),\n0)","v":0},{"$f":"IFERROR(\nINDEX(OFFSET(Q205,MATCH(\"\"&U205,Q205:Q$339,0),0):Q$339,MATCH(\"*\",OFFSET(Q205,MATCH(\"\"&U205,Q205:Q$339,0),0):Q$339,0)),\n0)","v":0}]
[null,null,null,null,"Water supply (sewerage, waste management and remediation activities)Waste collection, treatment and disposal activities; materials recoveryTreatment and disposal of hazardous waste","38.22","Water supply (sewerage, waste management and remediation activities)","Waste collection, treatment and disposal activities; materials recovery","Treatment and disposal of hazardous waste","High","High","High","t54","Not yet drafted",null,{"$f":"IF($G207=Section,\nIF(COUNTIFS(P$22:P206,$H207)=0,$H207,0),\n0)","v":0},{"$f":"IF(AND($G207=Section,$H207=Category),\nIF(COUNTIFS(Q$22:Q206,$I207)=0,$I207,0),\n0)","v":0},null,null,{"$f":"IFERROR(\nINDEX(OFFSET(P206,MATCH(\"\"&T206,P206:P$339,0),0):P$339,MATCH(\"*\",OFFSET(P206,MATCH(\"\"&T206,P206:P$339,0),0):P$339,0)),\n0)","v":0},{"$f":"IFERROR(\nINDEX(OFFSET(Q206,MATCH(\"\"&U206,Q206:Q$339,0),0):Q$339,MATCH(\"*\",OFFSET(Q206,MATCH(\"\"&U206,Q206:Q$339,0),0):Q$339,0)),\n0)","v":0}]
[null,null,null,null,"Water supply (sewerage, waste management and remediation activities)Waste collection, treatment and disposal activities; materials recoveryDismantling of wrecks","38.31","Water supply (sewerage, waste management and remediation activities)","Waste collection, treatment and disposal activities; materials recovery","Dismantling of wrecks","High","High","High","t35","Not yet drafted",null,{"$f":"IF($G208=Section,\nIF(COUNTIFS(P$22:P207,$H208)=0,$H208,0),\n0)","v":0},{"$f":"IF(AND($G208=Section,$H208=Category),\nIF(COUNTIFS(Q$22:Q207,$I208)=0,$I208,0),\n0)","v":0},null,null,{"$f":"IFERROR(\nINDEX(OFFSET(P207,MATCH(\"\"&T207,P207:P$339,0),0):P$339,MATCH(\"*\",OFFSET(P207,MATCH(\"\"&T207,P207:P$339,0),0):P$339,0)),\n0)","v":0},{"$f":"IFERROR(\nINDEX(OFFSET(Q207,MATCH(\"\"&U207,Q207:Q$339,0),0):Q$339,MATCH(\"*\",OFFSET(Q207,MATCH(\"\"&U207,Q207:Q$339,0),0):Q$339,0)),\n0)","v":0}]
[null,null,null,null,"Water supply (sewerage, waste management and remediation activities)Waste collection, treatment and disposal activities; materials recoveryRecovery of sorted materials","38.32","Water supply (sewerage, waste management and remediation activities)","Waste collection, treatment and disposal activities; materials recovery","Recovery of sorted materials","High","High","High","t52","Not yet drafted",null,{"$f":"IF($G209=Section,\nIF(COUNTIFS(P$22:P208,$H209)=0,$H209,0),\n0)","v":0},{"$f":"IF(AND($G209=Section,$H209=Category),\nIF(COUNTIFS(Q$22:Q208,$I209)=0,$I209,0),\n0)","v":0},null,null,{"$f":"IFERROR(\nINDEX(OFFSET(P208,MATCH(\"\"&T208,P208:P$339,0),0):P$339,MATCH(\"*\",OFFSET(P208,MATCH(\"\"&T208,P208:P$339,0),0):P$339,0)),\n0)","v":0},{"$f":"IFERROR(\nINDEX(OFFSET(Q208,MATCH(\"\"&U208,Q208:Q$339,0),0):Q$339,MATCH(\"*\",OFFSET(Q208,MATCH(\"\"&U208,Q208:Q$339,0),0):Q$339,0)),\n0)","v":0}]
[null,null,null,null,"Water supply (sewerage, waste management and remediation activities)Remediation activities and other waste management services[n/a]","39","Water supply (sewerage, waste management and remediation activities)","Remediation activities and other waste management services","[n/a]","High","High","High","t53","Not yet drafted",null,{"$f":"IF($G210=Section,\nIF(COUNTIFS(P$22:P209,$H210)=0,$H210,0),\n0)","v":0},{"$f":"IF(AND($G210=Section,$H210=Category),\nIF(COUNTIFS(Q$22:Q209,$I210)=0,$I210,0),\n0)","v":0},null,null,{"$f":"IFERROR(\nINDEX(OFFSET(P209,MATCH(\"\"&T209,P209:P$339,0),0):P$339,MATCH(\"*\",OFFSET(P209,MATCH(\"\"&T209,P209:P$339,0),0):P$339,0)),\n0)","v":0},{"$f":"IFERROR(\nINDEX(OFFSET(Q209,MATCH(\"\"&U209,Q209:Q$339,0),0):Q$339,MATCH(\"*\",OFFSET(Q209,MATCH(\"\"&U209,Q209:Q$339,0),0):Q$339,0)),\n0)","v":0}]
[null,null,null,null,"ConstructionConstruction of buildingsDevelopment of building projects","41.1","Construction","Construction of buildings","Development of building projects","Low","Low","Low","[n/a]","[n/a]",null,{"$f":"IF($G211=Section,\nIF(COUNTIFS(P$22:P210,$H211)=0,$H211,0),\n0)","v":0},{"$f":"IF(AND($G211=Section,$H211=Category),\nIF(COUNTIFS(Q$22:Q210,$I211)=0,$I211,0),\n0)","v":0},null,null,{"$f":"IFERROR(\nINDEX(OFFSET(P210,MATCH(\"\"&T210,P210:P$339,0),0):P$339,MATCH(\"*\",OFFSET(P210,MATCH(\"\"&T210,P210:P$339,0),0):P$339,0)),\n0)","v":0},{"$f":"IFERROR(\nINDEX(OFFSET(Q210,MATCH(\"\"&U210,Q210:Q$339,0),0):Q$339,MATCH(\"*\",OFFSET(Q210,MATCH(\"\"&U210,Q210:Q$339,0),0):Q$339,0)),\n0)","v":0}]
[null,null,null,null,"ConstructionConstruction of buildingsConstruction of residential and non-residential buildings","41.2","Construction","Construction of buildings","Construction of residential and non-residential buildings","High","High","High","t65","Not yet drafted",null,{"$f":"IF($G212=Section,\nIF(COUNTIFS(P$22:P211,$H212)=0,$H212,0),\n0)","v":0},{"$f":"IF(AND($G212=Section,$H212=Category),\nIF(COUNTIFS(Q$22:Q211,$I212)=0,$I212,0),\n0)","v":0},null,null,{"$f":"IFERROR(\nINDEX(OFFSET(P211,MATCH(\"\"&T211,P211:P$339,0),0):P$339,MATCH(\"*\",OFFSET(P211,MATCH(\"\"&T211,P211:P$339,0),0):P$339,0)),\n0)","v":0},{"$f":"IFERROR(\nINDEX(OFFSET(Q211,MATCH(\"\"&U211,Q211:Q$339,0),0):Q$339,MATCH(\"*\",OFFSET(Q211,MATCH(\"\"&U211,Q211:Q$339,0),0):Q$339,0)),\n0)","v":0}]
[null,null,null,null,"ConstructionCivil engineeringConstruction of roads and railways","42.1","Construction","Civil engineering","Construction of roads and railways","High","High","High","t113","Not yet drafted",null,{"$f":"IF($G213=Section,\nIF(COUNTIFS(P$22:P212,$H213)=0,$H213,0),\n0)","v":0},{"$f":"IF(AND($G213=Section,$H213=Category),\nIF(COUNTIFS(Q$22:Q212,$I213)=0,$I213,0),\n0)","v":0},null,null,{"$f":"IFERROR(\nINDEX(OFFSET(P212,MATCH(\"\"&T212,P212:P$339,0),0):P$339,MATCH(\"*\",OFFSET(P212,MATCH(\"\"&T212,P212:P$339,0),0):P$339,0)),\n0)","v":0},{"$f":"IFERROR(\nINDEX(OFFSET(Q212,MATCH(\"\"&U212,Q212:Q$339,0),0):Q$339,MATCH(\"*\",OFFSET(Q212,MATCH(\"\"&U212,Q212:Q$339,0),0):Q$339,0)),\n0)","v":0}]
[null,null,null,null,"ConstructionCivil engineeringConstruction of utility projects (for fluids, electricity and telecommunications)","42.2","Construction","Civil engineering","Construction of utility projects (for fluids, electricity and telecommunications)","High","High","High","t81","Drafted",null,{"$f":"IF($G214=Section,\nIF(COUNTIFS(P$22:P213,$H214)=0,$H214,0),\n0)","v":0},{"$f":"IF(AND($G214=Section,$H214=Category),\nIF(COUNTIFS(Q$22:Q213,$I214)=0,$I214,0),\n0)","v":0},null,null,{"$f":"IFERROR(\nINDEX(OFFSET(P213,MATCH(\"\"&T213,P213:P$339,0),0):P$339,MATCH(\"*\",OFFSET(P213,MATCH(\"\"&T213,P213:P$339,0),0):P$339,0)),\n0)","v":0},{"$f":"IFERROR(\nINDEX(OFFSET(Q213,MATCH(\"\"&U213,Q213:Q$339,0),0):Q$339,MATCH(\"*\",OFFSET(Q213,MATCH(\"\"&U213,Q213:Q$339,0),0):Q$339,0)),\n0)","v":0}]
[null,null,null,null,{"$f":"G215&H215&I215","v":"ConstructionCivil engineeringConstruction of other civil engineering projects (water projects, industrial facilities)"},"42.9","Construction","Civil engineering","Construction of other civil engineering projects (water projects, industrial facilities)","High","High","High","t81","Drafted",null,{"$f":"IF($G215=Section,\nIF(COUNTIFS(P$22:P214,$H215)=0,$H215,0),\n0)","v":0},{"$f":"IF(AND($G215=Section,$H215=Category),\nIF(COUNTIFS(Q$22:Q214,$I215)=0,$I215,0),\n0)","v":0},null,null,{"$f":"IFERROR(\nINDEX(OFFSET(P214,MATCH(\"\"&T214,P214:P$339,0),0):P$339,MATCH(\"*\",OFFSET(P214,MATCH(\"\"&T214,P214:P$339,0),0):P$339,0)),\n0)","v":0},{"$f":"IFERROR(\nINDEX(OFFSET(Q214,MATCH(\"\"&U214,Q214:Q$339,0),0):Q$339,MATCH(\"*\",OFFSET(Q214,MATCH(\"\"&U214,Q214:Q$339,0),0):Q$339,0)),\n0)","v":0}]
[null,null,null,null,"ConstructionSpecialised construction activitiesDemolition and site preparation (demolition, site preparation, test drilling and boring)","43.1","Construction","Specialised construction activities","Demolition and site preparation (demolition, site preparation, test drilling and boring)","High","High","High","t49","Not yet drafted",null,{"$f":"IF($G216=Section,\nIF(COUNTIFS(P$22:P215,$H216)=0,$H216,0),\n0)","v":0},{"$f":"IF(AND($G216=Section,$H216=Category),\nIF(COUNTIFS(Q$22:Q215,$I216)=0,$I216,0),\n0)","v":0},null,null,{"$f":"IFERROR(\nINDEX(OFFSET(P215,MATCH(\"\"&T215,P215:P$339,0),0):P$339,MATCH(\"*\",OFFSET(P215,MATCH(\"\"&T215,P215:P$339,0),0):P$339,0)),\n0)","v":0},{"$f":"IFERROR(\nINDEX(OFFSET(Q215,MATCH(\"\"&U215,Q215:Q$339,0),0):Q$339,MATCH(\"*\",OFFSET(Q215,MATCH(\"\"&U215,Q215:Q$339,0),0):Q$339,0)),\n0)","v":0}]
[null,null,null,null,"ConstructionSpecialised construction activitiesElectrical, plumbing and other construction installation activities","43.2","Construction","Specialised construction activities","Electrical, plumbing and other construction installation activities","Low","Medium","Medium","t81","Drafted",null,{"$f":"IF($G217=Section,\nIF(COUNTIFS(P$22:P216,$H217)=0,$H217,0),\n0)","v":0},{"$f":"IF(AND($G217=Section,$H217=Category),\nIF(COUNTIFS(Q$22:Q216,$I217)=0,$I217,0),\n0)","v":0},null,null,{"$f":"IFERROR(\nINDEX(OFFSET(P216,MATCH(\"\"&T216,P216:P$339,0),0):P$339,MATCH(\"*\",OFFSET(P216,MATCH(\"\"&T216,P216:P$339,0),0):P$339,0)),\n0)","v":0},{"$f":"IFERROR(\nINDEX(OFFSET(Q216,MATCH(\"\"&U216,Q216:Q$339,0),0):Q$339,MATCH(\"*\",OFFSET(Q216,MATCH(\"\"&U216,Q216:Q$339,0),0):Q$339,0)),\n0)","v":0}]
[null,null,null,null,"ConstructionSpecialised construction activitiesBuilding completion and finishing (plastering; joinery installation; floor and wall covering ; painting and glazing; etc.)","43.3","Construction","Specialised construction activities","Building completion and finishing (plastering; joinery installation; floor and wall covering ; painting and glazing; etc.)","Low","Medium","Medium","t81","Drafted",null,{"$f":"IF($G218=Section,\nIF(COUNTIFS(P$22:P217,$H218)=0,$H218,0),\n0)","v":0},{"$f":"IF(AND($G218=Section,$H218=Category),\nIF(COUNTIFS(Q$22:Q217,$I218)=0,$I218,0),\n0)","v":0},null,null,{"$f":"IFERROR(\nINDEX(OFFSET(P217,MATCH(\"\"&T217,P217:P$339,0),0):P$339,MATCH(\"*\",OFFSET(P217,MATCH(\"\"&T217,P217:P$339,0),0):P$339,0)),\n0)","v":0},{"$f":"IFERROR(\nINDEX(OFFSET(Q217,MATCH(\"\"&U217,Q217:Q$339,0),0):Q$339,MATCH(\"*\",OFFSET(Q217,MATCH(\"\"&U217,Q217:Q$339,0),0):Q$339,0)),\n0)","v":0}]
[null,null,null,null,"ConstructionSpecialised construction activitiesOther specialised construction activities","43.9","Construction","Specialised construction activities","Other specialised construction activities","Low","High","Medium","t49","Not yet drafted",null,{"$f":"IF($G219=Section,\nIF(COUNTIFS(P$22:P218,$H219)=0,$H219,0),\n0)","v":0},{"$f":"IF(AND($G219=Section,$H219=Category),\nIF(COUNTIFS(Q$22:Q218,$I219)=0,$I219,0),\n0)","v":0},null,null,{"$f":"IFERROR(\nINDEX(OFFSET(P218,MATCH(\"\"&T218,P218:P$339,0),0):P$339,MATCH(\"*\",OFFSET(P218,MATCH(\"\"&T218,P218:P$339,0),0):P$339,0)),\n0)","v":0},{"$f":"IFERROR(\nINDEX(OFFSET(Q218,MATCH(\"\"&U218,Q218:Q$339,0),0):Q$339,MATCH(\"*\",OFFSET(Q218,MATCH(\"\"&U218,Q218:Q$339,0),0):Q$339,0)),\n0)","v":0}]
[null,null,null,null,"Wholesale and retail tradeWholesale and retail trade and repair of motor vehicles and motorcyclesSale of motor vehicles","45.1","Wholesale and retail trade","Wholesale and retail trade and repair of motor vehicles and motorcycles","Sale of motor vehicles","Low","Low","Low","[n/a]","[n/a]",null,{"$f":"IF($G220=Section,\nIF(COUNTIFS(P$22:P219,$H220)=0,$H220,0),\n0)","v":0},{"$f":"IF(AND($G220=Section,$H220=Category),\nIF(COUNTIFS(Q$22:Q219,$I220)=0,$I220,0),\n0)","v":0},null,null,{"$f":"IFERROR(\nINDEX(OFFSET(P219,MATCH(\"\"&T219,P219:P$339,0),0):P$339,MATCH(\"*\",OFFSET(P219,MATCH(\"\"&T219,P219:P$339,0),0):P$339,0)),\n0)","v":0},{"$f":"IFERROR(\nINDEX(OFFSET(Q219,MATCH(\"\"&U219,Q219:Q$339,0),0):Q$339,MATCH(\"*\",OFFSET(Q219,MATCH(\"\"&U219,Q219:Q$339,0),0):Q$339,0)),\n0)","v":0}]
[null,null,null,null,"Wholesale and retail tradeWholesale and retail trade and repair of motor vehicles and motorcyclesMaintenance and repair of motor vehicles","45.2","Wholesale and retail trade","Wholesale and retail trade and repair of motor vehicles and motorcycles","Maintenance and repair of motor vehicles","Medium","Low","Medium","t89","Drafted",null,{"$f":"IF($G221=Section,\nIF(COUNTIFS(P$22:P220,$H221)=0,$H221,0),\n0)","v":0},{"$f":"IF(AND($G221=Section,$H221=Category),\nIF(COUNTIFS(Q$22:Q220,$I221)=0,$I221,0),\n0)","v":0},null,null,{"$f":"IFERROR(\nINDEX(OFFSET(P220,MATCH(\"\"&T220,P220:P$339,0),0):P$339,MATCH(\"*\",OFFSET(P220,MATCH(\"\"&T220,P220:P$339,0),0):P$339,0)),\n0)","v":0},{"$f":"IFERROR(\nINDEX(OFFSET(Q220,MATCH(\"\"&U220,Q220:Q$339,0),0):Q$339,MATCH(\"*\",OFFSET(Q220,MATCH(\"\"&U220,Q220:Q$339,0),0):Q$339,0)),\n0)","v":0}]
[null,null,null,null,"Wholesale and retail tradeWholesale and retail trade and repair of motor vehicles and motorcyclesSale of motor vehicle parts and accessories","45.3","Wholesale and retail trade","Wholesale and retail trade and repair of motor vehicles and motorcycles","Sale of motor vehicle parts and accessories","Low","Low","Low","[n/a]","[n/a]",null,{"$f":"IF($G222=Section,\nIF(COUNTIFS(P$22:P221,$H222)=0,$H222,0),\n0)","v":0},{"$f":"IF(AND($G222=Section,$H222=Category),\nIF(COUNTIFS(Q$22:Q221,$I222)=0,$I222,0),\n0)","v":0},null,null,{"$f":"IFERROR(\nINDEX(OFFSET(P221,MATCH(\"\"&T221,P221:P$339,0),0):P$339,MATCH(\"*\",OFFSET(P221,MATCH(\"\"&T221,P221:P$339,0),0):P$339,0)),\n0)","v":0},{"$f":"IFERROR(\nINDEX(OFFSET(Q221,MATCH(\"\"&U221,Q221:Q$339,0),0):Q$339,MATCH(\"*\",OFFSET(Q221,MATCH(\"\"&U221,Q221:Q$339,0),0):Q$339,0)),\n0)","v":0}]
[null,null,null,null,"Wholesale and retail tradeWholesale and retail trade and repair of motor vehicles and motorcyclesSale, maintenance and repair of motorcycles and related parts and accessories","45.4","Wholesale and retail trade","Wholesale and retail trade and repair of motor vehicles and motorcycles","Sale, maintenance and repair of motorcycles and related parts and accessories","Medium","Low","Medium","t89","Drafted",null,{"$f":"IF($G223=Section,\nIF(COUNTIFS(P$22:P222,$H223)=0,$H223,0),\n0)","v":0},{"$f":"IF(AND($G223=Section,$H223=Category),\nIF(COUNTIFS(Q$22:Q222,$I223)=0,$I223,0),\n0)","v":0},null,null,{"$f":"IFERROR(\nINDEX(OFFSET(P222,MATCH(\"\"&T222,P222:P$339,0),0):P$339,MATCH(\"*\",OFFSET(P222,MATCH(\"\"&T222,P222:P$339,0),0):P$339,0)),\n0)","v":0},{"$f":"IFERROR(\nINDEX(OFFSET(Q222,MATCH(\"\"&U222,Q222:Q$339,0),0):Q$339,MATCH(\"*\",OFFSET(Q222,MATCH(\"\"&U222,Q222:Q$339,0),0):Q$339,0)),\n0)","v":0}]
[null,null,null,null,"Wholesale and retail tradeWholesale trade, except of motor vehicles and motorcyclesWholesale on a fee or contract basis","46.1","Wholesale and retail trade","Wholesale trade, except of motor vehicles and motorcycles","Wholesale on a fee or contract basis","Low","Low","Low","[n/a]","[n/a]",null,{"$f":"IF($G224=Section,\nIF(COUNTIFS(P$22:P223,$H224)=0,$H224,0),\n0)","v":0},{"$f":"IF(AND($G224=Section,$H224=Category),\nIF(COUNTIFS(Q$22:Q223,$I224)=0,$I224,0),\n0)","v":0},null,null,{"$f":"IFERROR(\nINDEX(OFFSET(P223,MATCH(\"\"&T223,P223:P$339,0),0):P$339,MATCH(\"*\",OFFSET(P223,MATCH(\"\"&T223,P223:P$339,0),0):P$339,0)),\n0)","v":0},{"$f":"IFERROR(\nINDEX(OFFSET(Q223,MATCH(\"\"&U223,Q223:Q$339,0),0):Q$339,MATCH(\"*\",OFFSET(Q223,MATCH(\"\"&U223,Q223:Q$339,0),0):Q$339,0)),\n0)","v":0}]
[null,null,null,null,"Wholesale and retail tradeWholesale trade, except of motor vehicles and motorcyclesWholesale of grain, unmanufactured tobacco, seed and animal feeds","46.21","Wholesale and retail trade","Wholesale trade, except of motor vehicles and motorcycles","Wholesale of grain, unmanufactured tobacco, seed and animal feeds","Low","Low","Low","[n/a]","[n/a]",null,{"$f":"IF($G225=Section,\nIF(COUNTIFS(P$22:P224,$H225)=0,$H225,0),\n0)","v":0},{"$f":"IF(AND($G225=Section,$H225=Category),\nIF(COUNTIFS(Q$22:Q224,$I225)=0,$I225,0),\n0)","v":0},null,null,{"$f":"IFERROR(\nINDEX(OFFSET(P224,MATCH(\"\"&T224,P224:P$339,0),0):P$339,MATCH(\"*\",OFFSET(P224,MATCH(\"\"&T224,P224:P$339,0),0):P$339,0)),\n0)","v":0},{"$f":"IFERROR(\nINDEX(OFFSET(Q224,MATCH(\"\"&U224,Q224:Q$339,0),0):Q$339,MATCH(\"*\",OFFSET(Q224,MATCH(\"\"&U224,Q224:Q$339,0),0):Q$339,0)),\n0)","v":0}]
[null,null,null,null,"Wholesale and retail tradeWholesale trade, except of motor vehicles and motorcyclesWholesale of flowers and plants","46.22","Wholesale and retail trade","Wholesale trade, except of motor vehicles and motorcycles","Wholesale of flowers and plants","Low","Low","Low","[n/a]","[n/a]",null,{"$f":"IF($G226=Section,\nIF(COUNTIFS(P$22:P225,$H226)=0,$H226,0),\n0)","v":0},{"$f":"IF(AND($G226=Section,$H226=Category),\nIF(COUNTIFS(Q$22:Q225,$I226)=0,$I226,0),\n0)","v":0},null,null,{"$f":"IFERROR(\nINDEX(OFFSET(P225,MATCH(\"\"&T225,P225:P$339,0),0):P$339,MATCH(\"*\",OFFSET(P225,MATCH(\"\"&T225,P225:P$339,0),0):P$339,0)),\n0)","v":0},{"$f":"IFERROR(\nINDEX(OFFSET(Q225,MATCH(\"\"&U225,Q225:Q$339,0),0):Q$339,MATCH(\"*\",OFFSET(Q225,MATCH(\"\"&U225,Q225:Q$339,0),0):Q$339,0)),\n0)","v":0}]
[null,null,null,null,"Wholesale and retail tradeWholesale trade, except of motor vehicles and motorcyclesWholesale of live animals","46.23","Wholesale and retail trade","Wholesale trade, except of motor vehicles and motorcycles","Wholesale of live animals","Medium","Low","Medium","t114","Not yet drafted",null,{"$f":"IF($G227=Section,\nIF(COUNTIFS(P$22:P226,$H227)=0,$H227,0),\n0)","v":0},{"$f":"IF(AND($G227=Section,$H227=Category),\nIF(COUNTIFS(Q$22:Q226,$I227)=0,$I227,0),\n0)","v":0},null,null,{"$f":"IFERROR(\nINDEX(OFFSET(P226,MATCH(\"\"&T226,P226:P$339,0),0):P$339,MATCH(\"*\",OFFSET(P226,MATCH(\"\"&T226,P226:P$339,0),0):P$339,0)),\n0)","v":0},{"$f":"IFERROR(\nINDEX(OFFSET(Q226,MATCH(\"\"&U226,Q226:Q$339,0),0):Q$339,MATCH(\"*\",OFFSET(Q226,MATCH(\"\"&U226,Q226:Q$339,0),0):Q$339,0)),\n0)","v":0}]
[null,null,null,null,"Wholesale and retail tradeWholesale trade, except of motor vehicles and motorcyclesWholesale of hides, skins and leather","46.24","Wholesale and retail trade","Wholesale trade, except of motor vehicles and motorcycles","Wholesale of hides, skins and leather","Low","Low","Low","[n/a]","[n/a]",null,{"$f":"IF($G228=Section,\nIF(COUNTIFS(P$22:P227,$H228)=0,$H228,0),\n0)","v":0},{"$f":"IF(AND($G228=Section,$H228=Category),\nIF(COUNTIFS(Q$22:Q227,$I228)=0,$I228,0),\n0)","v":0},null,null,{"$f":"IFERROR(\nINDEX(OFFSET(P227,MATCH(\"\"&T227,P227:P$339,0),0):P$339,MATCH(\"*\",OFFSET(P227,MATCH(\"\"&T227,P227:P$339,0),0):P$339,0)),\n0)","v":0},{"$f":"IFERROR(\nINDEX(OFFSET(Q227,MATCH(\"\"&U227,Q227:Q$339,0),0):Q$339,MATCH(\"*\",OFFSET(Q227,MATCH(\"\"&U227,Q227:Q$339,0),0):Q$339,0)),\n0)","v":0}]
[null,null,null,null,"Wholesale and retail tradeWholesale trade, except of motor vehicles and motorcyclesWholesale of food, beverages and tobacco","46.3","Wholesale and retail trade","Wholesale trade, except of motor vehicles and motorcycles","Wholesale of food, beverages and tobacco","Low","Low","Low","[n/a]","[n/a]",null,{"$f":"IF($G229=Section,\nIF(COUNTIFS(P$22:P228,$H229)=0,$H229,0),\n0)","v":0},{"$f":"IF(AND($G229=Section,$H229=Category),\nIF(COUNTIFS(Q$22:Q228,$I229)=0,$I229,0),\n0)","v":0},null,null,{"$f":"IFERROR(\nINDEX(OFFSET(P228,MATCH(\"\"&T228,P228:P$339,0),0):P$339,MATCH(\"*\",OFFSET(P228,MATCH(\"\"&T228,P228:P$339,0),0):P$339,0)),\n0)","v":0},{"$f":"IFERROR(\nINDEX(OFFSET(Q228,MATCH(\"\"&U228,Q228:Q$339,0),0):Q$339,MATCH(\"*\",OFFSET(Q228,MATCH(\"\"&U228,Q228:Q$339,0),0):Q$339,0)),\n0)","v":0}]
[null,null,null,null,"Wholesale and retail tradeWholesale trade, except of motor vehicles and motorcyclesWholesale of tobacco products ","46.35","Wholesale and retail trade","Wholesale trade, except of motor vehicles and motorcycles","Wholesale of tobacco products ","Low","Low","Low","[n/a]","[n/a]",null,{"$f":"IF($G230=Section,\nIF(COUNTIFS(P$22:P229,$H230)=0,$H230,0),\n0)","v":0},{"$f":"IF(AND($G230=Section,$H230=Category),\nIF(COUNTIFS(Q$22:Q229,$I230)=0,$I230,0),\n0)","v":0},null,null,{"$f":"IFERROR(\nINDEX(OFFSET(P229,MATCH(\"\"&T229,P229:P$339,0),0):P$339,MATCH(\"*\",OFFSET(P229,MATCH(\"\"&T229,P229:P$339,0),0):P$339,0)),\n0)","v":0},{"$f":"IFERROR(\nINDEX(OFFSET(Q229,MATCH(\"\"&U229,Q229:Q$339,0),0):Q$339,MATCH(\"*\",OFFSET(Q229,MATCH(\"\"&U229,Q229:Q$339,0),0):Q$339,0)),\n0)","v":0}]
[null,null,null,null,"Wholesale and retail tradeWholesale trade, except of motor vehicles and motorcyclesWholesale of household goods","46.4","Wholesale and retail trade","Wholesale trade, except of motor vehicles and motorcycles","Wholesale of household goods","Low","Low","Low","[n/a]","[n/a]",null,{"$f":"IF($G231=Section,\nIF(COUNTIFS(P$22:P230,$H231)=0,$H231,0),\n0)","v":0},{"$f":"IF(AND($G231=Section,$H231=Category),\nIF(COUNTIFS(Q$22:Q230,$I231)=0,$I231,0),\n0)","v":0},null,null,{"$f":"IFERROR(\nINDEX(OFFSET(P230,MATCH(\"\"&T230,P230:P$339,0),0):P$339,MATCH(\"*\",OFFSET(P230,MATCH(\"\"&T230,P230:P$339,0),0):P$339,0)),\n0)","v":0},{"$f":"IFERROR(\nINDEX(OFFSET(Q230,MATCH(\"\"&U230,Q230:Q$339,0),0):Q$339,MATCH(\"*\",OFFSET(Q230,MATCH(\"\"&U230,Q230:Q$339,0),0):Q$339,0)),\n0)","v":0}]
[null,null,null,null,"Wholesale and retail tradeWholesale trade, except of motor vehicles and motorcyclesWholesale of information and communication equipment","46.5","Wholesale and retail trade","Wholesale trade, except of motor vehicles and motorcycles","Wholesale of information and communication equipment","Low","Low","Low","[n/a]","[n/a]",null,{"$f":"IF($G232=Section,\nIF(COUNTIFS(P$22:P231,$H232)=0,$H232,0),\n0)","v":0},{"$f":"IF(AND($G232=Section,$H232=Category),\nIF(COUNTIFS(Q$22:Q231,$I232)=0,$I232,0),\n0)","v":0},null,null,{"$f":"IFERROR(\nINDEX(OFFSET(P231,MATCH(\"\"&T231,P231:P$339,0),0):P$339,MATCH(\"*\",OFFSET(P231,MATCH(\"\"&T231,P231:P$339,0),0):P$339,0)),\n0)","v":0},{"$f":"IFERROR(\nINDEX(OFFSET(Q231,MATCH(\"\"&U231,Q231:Q$339,0),0):Q$339,MATCH(\"*\",OFFSET(Q231,MATCH(\"\"&U231,Q231:Q$339,0),0):Q$339,0)),\n0)","v":0}]
[null,null,null,null,"Wholesale and retail tradeWholesale trade, except of motor vehicles and motorcyclesWholesale of other machinery, equipment and supplies","46.6","Wholesale and retail trade","Wholesale trade, except of motor vehicles and motorcycles","Wholesale of other machinery, equipment and supplies","Low","Low","Low","[n/a]","[n/a]",null,{"$f":"IF($G233=Section,\nIF(COUNTIFS(P$22:P232,$H233)=0,$H233,0),\n0)","v":0},{"$f":"IF(AND($G233=Section,$H233=Category),\nIF(COUNTIFS(Q$22:Q232,$I233)=0,$I233,0),\n0)","v":0},null,null,{"$f":"IFERROR(\nINDEX(OFFSET(P232,MATCH(\"\"&T232,P232:P$339,0),0):P$339,MATCH(\"*\",OFFSET(P232,MATCH(\"\"&T232,P232:P$339,0),0):P$339,0)),\n0)","v":0},{"$f":"IFERROR(\nINDEX(OFFSET(Q232,MATCH(\"\"&U232,Q232:Q$339,0),0):Q$339,MATCH(\"*\",OFFSET(Q232,MATCH(\"\"&U232,Q232:Q$339,0),0):Q$339,0)),\n0)","v":0}]
[null,null,null,null,"Wholesale and retail tradeWholesale trade, except of motor vehicles and motorcyclesWholesale of solid, liquid and gaseous fuels and related products","46.71","Wholesale and retail trade","Wholesale trade, except of motor vehicles and motorcycles","Wholesale of solid, liquid and gaseous fuels and related products","High","High","High","t75","Drafted",null,{"$f":"IF($G234=Section,\nIF(COUNTIFS(P$22:P233,$H234)=0,$H234,0),\n0)","v":0},{"$f":"IF(AND($G234=Section,$H234=Category),\nIF(COUNTIFS(Q$22:Q233,$I234)=0,$I234,0),\n0)","v":0},null,null,{"$f":"IFERROR(\nINDEX(OFFSET(P233,MATCH(\"\"&T233,P233:P$339,0),0):P$339,MATCH(\"*\",OFFSET(P233,MATCH(\"\"&T233,P233:P$339,0),0):P$339,0)),\n0)","v":0},{"$f":"IFERROR(\nINDEX(OFFSET(Q233,MATCH(\"\"&U233,Q233:Q$339,0),0):Q$339,MATCH(\"*\",OFFSET(Q233,MATCH(\"\"&U233,Q233:Q$339,0),0):Q$339,0)),\n0)","v":0}]
[null,null,null,null,"Wholesale and retail tradeWholesale trade, except of motor vehicles and motorcyclesWholesale of metals and metal ores","46.72","Wholesale and retail trade","Wholesale trade, except of motor vehicles and motorcycles","Wholesale of metals and metal ores","High","High","High","t32","Not yet drafted",null,{"$f":"IF($G235=Section,\nIF(COUNTIFS(P$22:P234,$H235)=0,$H235,0),\n0)","v":0},{"$f":"IF(AND($G235=Section,$H235=Category),\nIF(COUNTIFS(Q$22:Q234,$I235)=0,$I235,0),\n0)","v":0},null,null,{"$f":"IFERROR(\nINDEX(OFFSET(P234,MATCH(\"\"&T234,P234:P$339,0),0):P$339,MATCH(\"*\",OFFSET(P234,MATCH(\"\"&T234,P234:P$339,0),0):P$339,0)),\n0)","v":0},{"$f":"IFERROR(\nINDEX(OFFSET(Q234,MATCH(\"\"&U234,Q234:Q$339,0),0):Q$339,MATCH(\"*\",OFFSET(Q234,MATCH(\"\"&U234,Q234:Q$339,0),0):Q$339,0)),\n0)","v":0}]
[null,null,null,null,"Wholesale and retail tradeWholesale trade, except of motor vehicles and motorcyclesWholesale of wood, construction materials and sanitary equipment","46.73","Wholesale and retail trade","Wholesale trade, except of motor vehicles and motorcycles","Wholesale of wood, construction materials and sanitary equipment","Medium","Low","Medium","t37","Not yet drafted",null,{"$f":"IF($G236=Section,\nIF(COUNTIFS(P$22:P235,$H236)=0,$H236,0),\n0)","v":0},{"$f":"IF(AND($G236=Section,$H236=Category),\nIF(COUNTIFS(Q$22:Q235,$I236)=0,$I236,0),\n0)","v":0},null,null,{"$f":"IFERROR(\nINDEX(OFFSET(P235,MATCH(\"\"&T235,P235:P$339,0),0):P$339,MATCH(\"*\",OFFSET(P235,MATCH(\"\"&T235,P235:P$339,0),0):P$339,0)),\n0)","v":0},{"$f":"IFERROR(\nINDEX(OFFSET(Q235,MATCH(\"\"&U235,Q235:Q$339,0),0):Q$339,MATCH(\"*\",OFFSET(Q235,MATCH(\"\"&U235,Q235:Q$339,0),0):Q$339,0)),\n0)","v":0}]
[null,null,null,null,"Wholesale and retail tradeWholesale trade, except of motor vehicles and motorcyclesWholesale of hardware, plumbing and heating equipment and supplies","46.74","Wholesale and retail trade","Wholesale trade, except of motor vehicles and motorcycles","Wholesale of hardware, plumbing and heating equipment and supplies","Low","Low","Low","[n/a]","[n/a]",null,{"$f":"IF($G237=Section,\nIF(COUNTIFS(P$22:P236,$H237)=0,$H237,0),\n0)","v":0},{"$f":"IF(AND($G237=Section,$H237=Category),\nIF(COUNTIFS(Q$22:Q236,$I237)=0,$I237,0),\n0)","v":0},null,null,{"$f":"IFERROR(\nINDEX(OFFSET(P236,MATCH(\"\"&T236,P236:P$339,0),0):P$339,MATCH(\"*\",OFFSET(P236,MATCH(\"\"&T236,P236:P$339,0),0):P$339,0)),\n0)","v":0},{"$f":"IFERROR(\nINDEX(OFFSET(Q236,MATCH(\"\"&U236,Q236:Q$339,0),0):Q$339,MATCH(\"*\",OFFSET(Q236,MATCH(\"\"&U236,Q236:Q$339,0),0):Q$339,0)),\n0)","v":0}]
[null,null,null,null,"Wholesale and retail tradeWholesale trade, except of motor vehicles and motorcyclesWholesale of chemical products","46.75","Wholesale and retail trade","Wholesale trade, except of motor vehicles and motorcycles","Wholesale of chemical products","High","High","High","t17","Not yet drafted",null,{"$f":"IF($G238=Section,\nIF(COUNTIFS(P$22:P237,$H238)=0,$H238,0),\n0)","v":0},{"$f":"IF(AND($G238=Section,$H238=Category),\nIF(COUNTIFS(Q$22:Q237,$I238)=0,$I238,0),\n0)","v":0},null,null,{"$f":"IFERROR(\nINDEX(OFFSET(P237,MATCH(\"\"&T237,P237:P$339,0),0):P$339,MATCH(\"*\",OFFSET(P237,MATCH(\"\"&T237,P237:P$339,0),0):P$339,0)),\n0)","v":0},{"$f":"IFERROR(\nINDEX(OFFSET(Q237,MATCH(\"\"&U237,Q237:Q$339,0),0):Q$339,MATCH(\"*\",OFFSET(Q237,MATCH(\"\"&U237,Q237:Q$339,0),0):Q$339,0)),\n0)","v":0}]
[null,null,null,null,"Wholesale and retail tradeWholesale trade, except of motor vehicles and motorcyclesWholesale of other intermediate products","46.76","Wholesale and retail trade","Wholesale trade, except of motor vehicles and motorcycles","Wholesale of other intermediate products","Low","Low","Low","[n/a]","[n/a]",null,{"$f":"IF($G239=Section,\nIF(COUNTIFS(P$22:P238,$H239)=0,$H239,0),\n0)","v":0},{"$f":"IF(AND($G239=Section,$H239=Category),\nIF(COUNTIFS(Q$22:Q238,$I239)=0,$I239,0),\n0)","v":0},null,null,{"$f":"IFERROR(\nINDEX(OFFSET(P238,MATCH(\"\"&T238,P238:P$339,0),0):P$339,MATCH(\"*\",OFFSET(P238,MATCH(\"\"&T238,P238:P$339,0),0):P$339,0)),\n0)","v":0},{"$f":"IFERROR(\nINDEX(OFFSET(Q238,MATCH(\"\"&U238,Q238:Q$339,0),0):Q$339,MATCH(\"*\",OFFSET(Q238,MATCH(\"\"&U238,Q238:Q$339,0),0):Q$339,0)),\n0)","v":0}]
[null,null,null,null,"Wholesale and retail tradeWholesale trade, except of motor vehicles and motorcyclesWholesale of waste and scrap","46.77","Wholesale and retail trade","Wholesale trade, except of motor vehicles and motorcycles","Wholesale of waste and scrap","High","High","High","t36","Not yet drafted",null,{"$f":"IF($G240=Section,\nIF(COUNTIFS(P$22:P239,$H240)=0,$H240,0),\n0)","v":0},{"$f":"IF(AND($G240=Section,$H240=Category),\nIF(COUNTIFS(Q$22:Q239,$I240)=0,$I240,0),\n0)","v":0},null,null,{"$f":"IFERROR(\nINDEX(OFFSET(P239,MATCH(\"\"&T239,P239:P$339,0),0):P$339,MATCH(\"*\",OFFSET(P239,MATCH(\"\"&T239,P239:P$339,0),0):P$339,0)),\n0)","v":0},{"$f":"IFERROR(\nINDEX(OFFSET(Q239,MATCH(\"\"&U239,Q239:Q$339,0),0):Q$339,MATCH(\"*\",OFFSET(Q239,MATCH(\"\"&U239,Q239:Q$339,0),0):Q$339,0)),\n0)","v":0}]
[null,null,null,null,"Wholesale and retail tradeWholesale trade, except of motor vehicles and motorcyclesNon-specialised wholesale trade","46.9","Wholesale and retail trade","Wholesale trade, except of motor vehicles and motorcycles","Non-specialised wholesale trade","Low","Low","Low","[n/a]","[n/a]",null,{"$f":"IF($G241=Section,\nIF(COUNTIFS(P$22:P240,$H241)=0,$H241,0),\n0)","v":0},{"$f":"IF(AND($G241=Section,$H241=Category),\nIF(COUNTIFS(Q$22:Q240,$I241)=0,$I241,0),\n0)","v":0},null,null,{"$f":"IFERROR(\nINDEX(OFFSET(P240,MATCH(\"\"&T240,P240:P$339,0),0):P$339,MATCH(\"*\",OFFSET(P240,MATCH(\"\"&T240,P240:P$339,0),0):P$339,0)),\n0)","v":0},{"$f":"IFERROR(\nINDEX(OFFSET(Q240,MATCH(\"\"&U240,Q240:Q$339,0),0):Q$339,MATCH(\"*\",OFFSET(Q240,MATCH(\"\"&U240,Q240:Q$339,0),0):Q$339,0)),\n0)","v":0}]
[null,null,null,null,"Wholesale and retail tradeRetail trade, except of motor vehicles and motorcyclesRetail trade, except of motor vehicles and motorcycles, n.e.c.","47","Wholesale and retail trade","Retail trade, except of motor vehicles and motorcycles","Retail trade, except of motor vehicles and motorcycles, n.e.c.","Low","Low","Low","[n/a]","[n/a]",null,{"$f":"IF($G242=Section,\nIF(COUNTIFS(P$22:P241,$H242)=0,$H242,0),\n0)","v":0},{"$f":"IF(AND($G242=Section,$H242=Category),\nIF(COUNTIFS(Q$22:Q241,$I242)=0,$I242,0),\n0)","v":0},null,null,{"$f":"IFERROR(\nINDEX(OFFSET(P241,MATCH(\"\"&T241,P241:P$339,0),0):P$339,MATCH(\"*\",OFFSET(P241,MATCH(\"\"&T241,P241:P$339,0),0):P$339,0)),\n0)","v":0},{"$f":"IFERROR(\nINDEX(OFFSET(Q241,MATCH(\"\"&U241,Q241:Q$339,0),0):Q$339,MATCH(\"*\",OFFSET(Q241,MATCH(\"\"&U241,Q241:Q$339,0),0):Q$339,0)),\n0)","v":0}]
[null,null,null,null,"Wholesale and retail tradeRetail trade, except of motor vehicles and motorcyclesRetail sale in non-specialised stores with food, beverages or tobacco predominating","47.11","Wholesale and retail trade","Retail trade, except of motor vehicles and motorcycles","Retail sale in non-specialised stores with food, beverages or tobacco predominating","Low","Medium","Medium","t87","Drafted",null,{"$f":"IF($G243=Section,\nIF(COUNTIFS(P$22:P242,$H243)=0,$H243,0),\n0)","v":0},{"$f":"IF(AND($G243=Section,$H243=Category),\nIF(COUNTIFS(Q$22:Q242,$I243)=0,$I243,0),\n0)","v":0},null,null,{"$f":"IFERROR(\nINDEX(OFFSET(P242,MATCH(\"\"&T242,P242:P$339,0),0):P$339,MATCH(\"*\",OFFSET(P242,MATCH(\"\"&T242,P242:P$339,0),0):P$339,0)),\n0)","v":0},{"$f":"IFERROR(\nINDEX(OFFSET(Q242,MATCH(\"\"&U242,Q242:Q$339,0),0):Q$339,MATCH(\"*\",OFFSET(Q242,MATCH(\"\"&U242,Q242:Q$339,0),0):Q$339,0)),\n0)","v":0}]
[null,null,null,null,"Wholesale and retail tradeRetail trade, except of motor vehicles and motorcyclesOther retail sale in non-specialised stores","47.19","Wholesale and retail trade","Retail trade, except of motor vehicles and motorcycles","Other retail sale in non-specialised stores","Low","Low","Low","[n/a]","[n/a]",null,{"$f":"IF($G244=Section,\nIF(COUNTIFS(P$22:P243,$H244)=0,$H244,0),\n0)","v":0},{"$f":"IF(AND($G244=Section,$H244=Category),\nIF(COUNTIFS(Q$22:Q243,$I244)=0,$I244,0),\n0)","v":0},null,null,{"$f":"IFERROR(\nINDEX(OFFSET(P243,MATCH(\"\"&T243,P243:P$339,0),0):P$339,MATCH(\"*\",OFFSET(P243,MATCH(\"\"&T243,P243:P$339,0),0):P$339,0)),\n0)","v":0},{"$f":"IFERROR(\nINDEX(OFFSET(Q243,MATCH(\"\"&U243,Q243:Q$339,0),0):Q$339,MATCH(\"*\",OFFSET(Q243,MATCH(\"\"&U243,Q243:Q$339,0),0):Q$339,0)),\n0)","v":0}]
[null,null,null,null,"Wholesale and retail tradeRetail trade, except of motor vehicles and motorcyclesRetail sale of food, beverages and tobacco in specialised stores","47.2","Wholesale and retail trade","Retail trade, except of motor vehicles and motorcycles","Retail sale of food, beverages and tobacco in specialised stores","Low","Low","Low","[n/a]","[n/a]",null,{"$f":"IF($G245=Section,\nIF(COUNTIFS(P$22:P244,$H245)=0,$H245,0),\n0)","v":0},{"$f":"IF(AND($G245=Section,$H245=Category),\nIF(COUNTIFS(Q$22:Q244,$I245)=0,$I245,0),\n0)","v":0},null,null,{"$f":"IFERROR(\nINDEX(OFFSET(P244,MATCH(\"\"&T244,P244:P$339,0),0):P$339,MATCH(\"*\",OFFSET(P244,MATCH(\"\"&T244,P244:P$339,0),0):P$339,0)),\n0)","v":0},{"$f":"IFERROR(\nINDEX(OFFSET(Q244,MATCH(\"\"&U244,Q244:Q$339,0),0):Q$339,MATCH(\"*\",OFFSET(Q244,MATCH(\"\"&U244,Q244:Q$339,0),0):Q$339,0)),\n0)","v":0}]
[null,null,null,null,"Wholesale and retail tradeRetail trade, except of motor vehicles and motorcyclesRetail sale of tobacco products in specialised stores","47.26","Wholesale and retail trade","Retail trade, except of motor vehicles and motorcycles","Retail sale of tobacco products in specialised stores","Low","Low","Low","[n/a]","[n/a]",null,{"$f":"IF($G246=Section,\nIF(COUNTIFS(P$22:P245,$H246)=0,$H246,0),\n0)","v":0},{"$f":"IF(AND($G246=Section,$H246=Category),\nIF(COUNTIFS(Q$22:Q245,$I246)=0,$I246,0),\n0)","v":0},null,null,{"$f":"IFERROR(\nINDEX(OFFSET(P245,MATCH(\"\"&T245,P245:P$339,0),0):P$339,MATCH(\"*\",OFFSET(P245,MATCH(\"\"&T245,P245:P$339,0),0):P$339,0)),\n0)","v":0},{"$f":"IFERROR(\nINDEX(OFFSET(Q245,MATCH(\"\"&U245,Q245:Q$339,0),0):Q$339,MATCH(\"*\",OFFSET(Q245,MATCH(\"\"&U245,Q245:Q$339,0),0):Q$339,0)),\n0)","v":0}]
[null,null,null,null,"Wholesale and retail tradeRetail trade, except of motor vehicles and motorcyclesRetail sale of automotive fuel in specialised stores","47.3","Wholesale and retail trade","Retail trade, except of motor vehicles and motorcycles","Retail sale of automotive fuel in specialised stores","High","Medium","High","t75","Drafted",null,{"$f":"IF($G247=Section,\nIF(COUNTIFS(P$22:P246,$H247)=0,$H247,0),\n0)","v":0},{"$f":"IF(AND($G247=Section,$H247=Category),\nIF(COUNTIFS(Q$22:Q246,$I247)=0,$I247,0),\n0)","v":0},null,null,{"$f":"IFERROR(\nINDEX(OFFSET(P246,MATCH(\"\"&T246,P246:P$339,0),0):P$339,MATCH(\"*\",OFFSET(P246,MATCH(\"\"&T246,P246:P$339,0),0):P$339,0)),\n0)","v":0},{"$f":"IFERROR(\nINDEX(OFFSET(Q246,MATCH(\"\"&U246,Q246:Q$339,0),0):Q$339,MATCH(\"*\",OFFSET(Q246,MATCH(\"\"&U246,Q246:Q$339,0),0):Q$339,0)),\n0)","v":0}]
[null,null,null,null,"Wholesale and retail tradeRetail trade, except of motor vehicles and motorcyclesRetail sale of information and communication equipment in specialised stores","47.4","Wholesale and retail trade","Retail trade, except of motor vehicles and motorcycles","Retail sale of information and communication equipment in specialised stores","Low","Low","Low","[n/a]","[n/a]",null,{"$f":"IF($G248=Section,\nIF(COUNTIFS(P$22:P247,$H248)=0,$H248,0),\n0)","v":0},{"$f":"IF(AND($G248=Section,$H248=Category),\nIF(COUNTIFS(Q$22:Q247,$I248)=0,$I248,0),\n0)","v":0},null,null,{"$f":"IFERROR(\nINDEX(OFFSET(P247,MATCH(\"\"&T247,P247:P$339,0),0):P$339,MATCH(\"*\",OFFSET(P247,MATCH(\"\"&T247,P247:P$339,0),0):P$339,0)),\n0)","v":0},{"$f":"IFERROR(\nINDEX(OFFSET(Q247,MATCH(\"\"&U247,Q247:Q$339,0),0):Q$339,MATCH(\"*\",OFFSET(Q247,MATCH(\"\"&U247,Q247:Q$339,0),0):Q$339,0)),\n0)","v":0}]
[null,null,null,null,"Wholesale and retail tradeRetail trade, except of motor vehicles and motorcyclesRetail sale of other household equipment in specialised stores","47.5","Wholesale and retail trade","Retail trade, except of motor vehicles and motorcycles","Retail sale of other household equipment in specialised stores","Low","Low","Low","[n/a]","[n/a]",null,{"$f":"IF($G249=Section,\nIF(COUNTIFS(P$22:P248,$H249)=0,$H249,0),\n0)","v":0},{"$f":"IF(AND($G249=Section,$H249=Category),\nIF(COUNTIFS(Q$22:Q248,$I249)=0,$I249,0),\n0)","v":0},null,null,{"$f":"IFERROR(\nINDEX(OFFSET(P248,MATCH(\"\"&T248,P248:P$339,0),0):P$339,MATCH(\"*\",OFFSET(P248,MATCH(\"\"&T248,P248:P$339,0),0):P$339,0)),\n0)","v":0},{"$f":"IFERROR(\nINDEX(OFFSET(Q248,MATCH(\"\"&U248,Q248:Q$339,0),0):Q$339,MATCH(\"*\",OFFSET(Q248,MATCH(\"\"&U248,Q248:Q$339,0),0):Q$339,0)),\n0)","v":0}]
[null,null,null,null,"Wholesale and retail tradeRetail trade, except of motor vehicles and motorcyclesRetail sale of cultural and recreation goods in specialised stores","47.6","Wholesale and retail trade","Retail trade, except of motor vehicles and motorcycles","Retail sale of cultural and recreation goods in specialised stores","Low","Low","Low","[n/a]","[n/a]",null,{"$f":"IF($G250=Section,\nIF(COUNTIFS(P$22:P249,$H250)=0,$H250,0),\n0)","v":0},{"$f":"IF(AND($G250=Section,$H250=Category),\nIF(COUNTIFS(Q$22:Q249,$I250)=0,$I250,0),\n0)","v":0},null,null,{"$f":"IFERROR(\nINDEX(OFFSET(P249,MATCH(\"\"&T249,P249:P$339,0),0):P$339,MATCH(\"*\",OFFSET(P249,MATCH(\"\"&T249,P249:P$339,0),0):P$339,0)),\n0)","v":0},{"$f":"IFERROR(\nINDEX(OFFSET(Q249,MATCH(\"\"&U249,Q249:Q$339,0),0):Q$339,MATCH(\"*\",OFFSET(Q249,MATCH(\"\"&U249,Q249:Q$339,0),0):Q$339,0)),\n0)","v":0}]
[null,null,null,null,"Wholesale and retail tradeRetail trade, except of motor vehicles and motorcyclesRetail sale of other goods in specialised stores","47.7","Wholesale and retail trade","Retail trade, except of motor vehicles and motorcycles","Retail sale of other goods in specialised stores","Low","Low","Low","[n/a]","[n/a]",null,{"$f":"IF($G251=Section,\nIF(COUNTIFS(P$22:P250,$H251)=0,$H251,0),\n0)","v":0},{"$f":"IF(AND($G251=Section,$H251=Category),\nIF(COUNTIFS(Q$22:Q250,$I251)=0,$I251,0),\n0)","v":0},null,null,{"$f":"IFERROR(\nINDEX(OFFSET(P250,MATCH(\"\"&T250,P250:P$339,0),0):P$339,MATCH(\"*\",OFFSET(P250,MATCH(\"\"&T250,P250:P$339,0),0):P$339,0)),\n0)","v":0},{"$f":"IFERROR(\nINDEX(OFFSET(Q250,MATCH(\"\"&U250,Q250:Q$339,0),0):Q$339,MATCH(\"*\",OFFSET(Q250,MATCH(\"\"&U250,Q250:Q$339,0),0):Q$339,0)),\n0)","v":0}]
[null,null,null,null,"Wholesale and retail tradeRetail trade, except of motor vehicles and motorcyclesDispensing chemist in specialised stores","47.73","Wholesale and retail trade","Retail trade, except of motor vehicles and motorcycles","Dispensing chemist in specialised stores","Low","Medium","Medium","t73","Drafted",null,{"$f":"IF($G252=Section,\nIF(COUNTIFS(P$22:P251,$H252)=0,$H252,0),\n0)","v":0},{"$f":"IF(AND($G252=Section,$H252=Category),\nIF(COUNTIFS(Q$22:Q251,$I252)=0,$I252,0),\n0)","v":0},null,null,{"$f":"IFERROR(\nINDEX(OFFSET(P251,MATCH(\"\"&T251,P251:P$339,0),0):P$339,MATCH(\"*\",OFFSET(P251,MATCH(\"\"&T251,P251:P$339,0),0):P$339,0)),\n0)","v":0},{"$f":"IFERROR(\nINDEX(OFFSET(Q251,MATCH(\"\"&U251,Q251:Q$339,0),0):Q$339,MATCH(\"*\",OFFSET(Q251,MATCH(\"\"&U251,Q251:Q$339,0),0):Q$339,0)),\n0)","v":0}]
[null,null,null,null,"Wholesale and retail tradeRetail trade, except of motor vehicles and motorcyclesRetail sale of medical and orthopaedic goods in specialised stores","47.74","Wholesale and retail trade","Retail trade, except of motor vehicles and motorcycles","Retail sale of medical and orthopaedic goods in specialised stores","Low","Medium","Medium","t73","Drafted",null,{"$f":"IF($G253=Section,\nIF(COUNTIFS(P$22:P252,$H253)=0,$H253,0),\n0)","v":0},{"$f":"IF(AND($G253=Section,$H253=Category),\nIF(COUNTIFS(Q$22:Q252,$I253)=0,$I253,0),\n0)","v":0},null,null,{"$f":"IFERROR(\nINDEX(OFFSET(P252,MATCH(\"\"&T252,P252:P$339,0),0):P$339,MATCH(\"*\",OFFSET(P252,MATCH(\"\"&T252,P252:P$339,0),0):P$339,0)),\n0)","v":0},{"$f":"IFERROR(\nINDEX(OFFSET(Q252,MATCH(\"\"&U252,Q252:Q$339,0),0):Q$339,MATCH(\"*\",OFFSET(Q252,MATCH(\"\"&U252,Q252:Q$339,0),0):Q$339,0)),\n0)","v":0}]
[null,null,null,null,"Wholesale and retail tradeRetail trade, except of motor vehicles and motorcyclesRetail sale of flowers, plants, seeds, fertilisers, pet animals and pet food in specialised stores","47.76","Wholesale and retail trade","Retail trade, except of motor vehicles and motorcycles","Retail sale of flowers, plants, seeds, fertilisers, pet animals and pet food in specialised stores","Low","Low","Low","t11","Not yet drafted",null,{"$f":"IF($G254=Section,\nIF(COUNTIFS(P$22:P253,$H254)=0,$H254,0),\n0)","v":0},{"$f":"IF(AND($G254=Section,$H254=Category),\nIF(COUNTIFS(Q$22:Q253,$I254)=0,$I254,0),\n0)","v":0},null,null,{"$f":"IFERROR(\nINDEX(OFFSET(P253,MATCH(\"\"&T253,P253:P$339,0),0):P$339,MATCH(\"*\",OFFSET(P253,MATCH(\"\"&T253,P253:P$339,0),0):P$339,0)),\n0)","v":0},{"$f":"IFERROR(\nINDEX(OFFSET(Q253,MATCH(\"\"&U253,Q253:Q$339,0),0):Q$339,MATCH(\"*\",OFFSET(Q253,MATCH(\"\"&U253,Q253:Q$339,0),0):Q$339,0)),\n0)","v":0}]
[null,null,null,null,"Wholesale and retail tradeRetail trade, except of motor vehicles and motorcyclesRetail sale via stalls and markets","47.8","Wholesale and retail trade","Retail trade, except of motor vehicles and motorcycles","Retail sale via stalls and markets","Low","Low","Low","[n/a]","[n/a]",null,{"$f":"IF($G255=Section,\nIF(COUNTIFS(P$22:P254,$H255)=0,$H255,0),\n0)","v":0},{"$f":"IF(AND($G255=Section,$H255=Category),\nIF(COUNTIFS(Q$22:Q254,$I255)=0,$I255,0),\n0)","v":0},null,null,{"$f":"IFERROR(\nINDEX(OFFSET(P254,MATCH(\"\"&T254,P254:P$339,0),0):P$339,MATCH(\"*\",OFFSET(P254,MATCH(\"\"&T254,P254:P$339,0),0):P$339,0)),\n0)","v":0},{"$f":"IFERROR(\nINDEX(OFFSET(Q254,MATCH(\"\"&U254,Q254:Q$339,0),0):Q$339,MATCH(\"*\",OFFSET(Q254,MATCH(\"\"&U254,Q254:Q$339,0),0):Q$339,0)),\n0)","v":0}]
[null,null,null,null,"Wholesale and retail tradeRetail trade, except of motor vehicles and motorcyclesRetail trade not in stores, stalls or markets","47.9","Wholesale and retail trade","Retail trade, except of motor vehicles and motorcycles","Retail trade not in stores, stalls or markets","Low","Low","Low","[n/a]","[n/a]",null,{"$f":"IF($G256=Section,\nIF(COUNTIFS(P$22:P255,$H256)=0,$H256,0),\n0)","v":0},{"$f":"IF(AND($G256=Section,$H256=Category),\nIF(COUNTIFS(Q$22:Q255,$I256)=0,$I256,0),\n0)","v":0},null,null,{"$f":"IFERROR(\nINDEX(OFFSET(P255,MATCH(\"\"&T255,P255:P$339,0),0):P$339,MATCH(\"*\",OFFSET(P255,MATCH(\"\"&T255,P255:P$339,0),0):P$339,0)),\n0)","v":0},{"$f":"IFERROR(\nINDEX(OFFSET(Q255,MATCH(\"\"&U255,Q255:Q$339,0),0):Q$339,MATCH(\"*\",OFFSET(Q255,MATCH(\"\"&U255,Q255:Q$339,0),0):Q$339,0)),\n0)","v":0}]
[null,null,null,null,"Transportation and StorageLand transport and transport via pipelinesPassenger rail transport, interurban","49.1","Transportation and Storage","Land transport and transport via pipelines","Passenger rail transport, interurban","Low","Low","Low","[n/a]","[n/a]",null,{"$f":"IF($G257=Section,\nIF(COUNTIFS(P$22:P256,$H257)=0,$H257,0),\n0)","v":0},{"$f":"IF(AND($G257=Section,$H257=Category),\nIF(COUNTIFS(Q$22:Q256,$I257)=0,$I257,0),\n0)","v":0},null,null,{"$f":"IFERROR(\nINDEX(OFFSET(P256,MATCH(\"\"&T256,P256:P$339,0),0):P$339,MATCH(\"*\",OFFSET(P256,MATCH(\"\"&T256,P256:P$339,0),0):P$339,0)),\n0)","v":0},{"$f":"IFERROR(\nINDEX(OFFSET(Q256,MATCH(\"\"&U256,Q256:Q$339,0),0):Q$339,MATCH(\"*\",OFFSET(Q256,MATCH(\"\"&U256,Q256:Q$339,0),0):Q$339,0)),\n0)","v":0}]
[null,null,null,null,"Transportation and StorageLand transport and transport via pipelinesFreight rail transport","49.2","Transportation and Storage","Land transport and transport via pipelines","Freight rail transport","Low","Low","Low","[n/a]","[n/a]",null,{"$f":"IF($G258=Section,\nIF(COUNTIFS(P$22:P257,$H258)=0,$H258,0),\n0)","v":0},{"$f":"IF(AND($G258=Section,$H258=Category),\nIF(COUNTIFS(Q$22:Q257,$I258)=0,$I258,0),\n0)","v":0},null,null,{"$f":"IFERROR(\nINDEX(OFFSET(P257,MATCH(\"\"&T257,P257:P$339,0),0):P$339,MATCH(\"*\",OFFSET(P257,MATCH(\"\"&T257,P257:P$339,0),0):P$339,0)),\n0)","v":0},{"$f":"IFERROR(\nINDEX(OFFSET(Q257,MATCH(\"\"&U257,Q257:Q$339,0),0):Q$339,MATCH(\"*\",OFFSET(Q257,MATCH(\"\"&U257,Q257:Q$339,0),0):Q$339,0)),\n0)","v":0}]
[null,null,null,null,"Transportation and StorageLand transport and transport via pipelinesOther passenger land transport","49.3","Transportation and Storage","Land transport and transport via pipelines","Other passenger land transport","Low","Medium","Medium","t106","Drafted",null,{"$f":"IF($G259=Section,\nIF(COUNTIFS(P$22:P258,$H259)=0,$H259,0),\n0)","v":0},{"$f":"IF(AND($G259=Section,$H259=Category),\nIF(COUNTIFS(Q$22:Q258,$I259)=0,$I259,0),\n0)","v":0},null,null,{"$f":"IFERROR(\nINDEX(OFFSET(P258,MATCH(\"\"&T258,P258:P$339,0),0):P$339,MATCH(\"*\",OFFSET(P258,MATCH(\"\"&T258,P258:P$339,0),0):P$339,0)),\n0)","v":0},{"$f":"IFERROR(\nINDEX(OFFSET(Q258,MATCH(\"\"&U258,Q258:Q$339,0),0):Q$339,MATCH(\"*\",OFFSET(Q258,MATCH(\"\"&U258,Q258:Q$339,0),0):Q$339,0)),\n0)","v":0}]
[null,null,null,null,"Transportation and StorageLand transport and transport via pipelinesFreight transport by road and removal services","49.4","Transportation and Storage","Land transport and transport via pipelines","Freight transport by road and removal services","Low","Medium","Medium","t106","Drafted",null,{"$f":"IF($G260=Section,\nIF(COUNTIFS(P$22:P259,$H260)=0,$H260,0),\n0)","v":0},{"$f":"IF(AND($G260=Section,$H260=Category),\nIF(COUNTIFS(Q$22:Q259,$I260)=0,$I260,0),\n0)","v":0},null,null,{"$f":"IFERROR(\nINDEX(OFFSET(P259,MATCH(\"\"&T259,P259:P$339,0),0):P$339,MATCH(\"*\",OFFSET(P259,MATCH(\"\"&T259,P259:P$339,0),0):P$339,0)),\n0)","v":0},{"$f":"IFERROR(\nINDEX(OFFSET(Q259,MATCH(\"\"&U259,Q259:Q$339,0),0):Q$339,MATCH(\"*\",OFFSET(Q259,MATCH(\"\"&U259,Q259:Q$339,0),0):Q$339,0)),\n0)","v":0}]
[null,null,null,null,"Transportation and StorageLand transport and transport via pipelinesTransport via pipeline","49.5","Transportation and Storage","Land transport and transport via pipelines","Transport via pipeline","High","Medium","High","t48","Not yet drafted",null,{"$f":"IF($G261=Section,\nIF(COUNTIFS(P$22:P260,$H261)=0,$H261,0),\n0)","v":0},{"$f":"IF(AND($G261=Section,$H261=Category),\nIF(COUNTIFS(Q$22:Q260,$I261)=0,$I261,0),\n0)","v":0},null,null,{"$f":"IFERROR(\nINDEX(OFFSET(P260,MATCH(\"\"&T260,P260:P$339,0),0):P$339,MATCH(\"*\",OFFSET(P260,MATCH(\"\"&T260,P260:P$339,0),0):P$339,0)),\n0)","v":0},{"$f":"IFERROR(\nINDEX(OFFSET(Q260,MATCH(\"\"&U260,Q260:Q$339,0),0):Q$339,MATCH(\"*\",OFFSET(Q260,MATCH(\"\"&U260,Q260:Q$339,0),0):Q$339,0)),\n0)","v":0}]
[null,null,null,null,"Transportation and StorageLand transport and transport via pipelinesSea and coastal passenger water transport","50.1","Transportation and Storage","Land transport and transport via pipelines","Sea and coastal passenger water transport","Medium","Medium","Medium","t125","Not yet drafted",null,{"$f":"IF($G262=Section,\nIF(COUNTIFS(P$22:P261,$H262)=0,$H262,0),\n0)","v":0},{"$f":"IF(AND($G262=Section,$H262=Category),\nIF(COUNTIFS(Q$22:Q261,$I262)=0,$I262,0),\n0)","v":0},null,null,{"$f":"IFERROR(\nINDEX(OFFSET(P261,MATCH(\"\"&T261,P261:P$339,0),0):P$339,MATCH(\"*\",OFFSET(P261,MATCH(\"\"&T261,P261:P$339,0),0):P$339,0)),\n0)","v":0},{"$f":"IFERROR(\nINDEX(OFFSET(Q261,MATCH(\"\"&U261,Q261:Q$339,0),0):Q$339,MATCH(\"*\",OFFSET(Q261,MATCH(\"\"&U261,Q261:Q$339,0),0):Q$339,0)),\n0)","v":0}]
[null,null,null,null,"Transportation and StorageLand transport and transport via pipelinesSea and coastal freight water transport","50.2","Transportation and Storage","Land transport and transport via pipelines","Sea and coastal freight water transport","High","Medium","High","t125","Not yet drafted",null,{"$f":"IF($G263=Section,\nIF(COUNTIFS(P$22:P262,$H263)=0,$H263,0),\n0)","v":0},{"$f":"IF(AND($G263=Section,$H263=Category),\nIF(COUNTIFS(Q$22:Q262,$I263)=0,$I263,0),\n0)","v":0},null,null,{"$f":"IFERROR(\nINDEX(OFFSET(P262,MATCH(\"\"&T262,P262:P$339,0),0):P$339,MATCH(\"*\",OFFSET(P262,MATCH(\"\"&T262,P262:P$339,0),0):P$339,0)),\n0)","v":0},{"$f":"IFERROR(\nINDEX(OFFSET(Q262,MATCH(\"\"&U262,Q262:Q$339,0),0):Q$339,MATCH(\"*\",OFFSET(Q262,MATCH(\"\"&U262,Q262:Q$339,0),0):Q$339,0)),\n0)","v":0}]
[null,null,null,null,"Transportation and StorageLand transport and transport via pipelinesInland passenger water transport","50.3","Transportation and Storage","Land transport and transport via pipelines","Inland passenger water transport","Medium","Low","Medium","t125","Not yet drafted",null,{"$f":"IF($G264=Section,\nIF(COUNTIFS(P$22:P263,$H264)=0,$H264,0),\n0)","v":0},{"$f":"IF(AND($G264=Section,$H264=Category),\nIF(COUNTIFS(Q$22:Q263,$I264)=0,$I264,0),\n0)","v":0},null,null,{"$f":"IFERROR(\nINDEX(OFFSET(P263,MATCH(\"\"&T263,P263:P$339,0),0):P$339,MATCH(\"*\",OFFSET(P263,MATCH(\"\"&T263,P263:P$339,0),0):P$339,0)),\n0)","v":0},{"$f":"IFERROR(\nINDEX(OFFSET(Q263,MATCH(\"\"&U263,Q263:Q$339,0),0):Q$339,MATCH(\"*\",OFFSET(Q263,MATCH(\"\"&U263,Q263:Q$339,0),0):Q$339,0)),\n0)","v":0}]
[null,null,null,null,"Transportation and StorageLand transport and transport via pipelinesInland freight water transport","50.4","Transportation and Storage","Land transport and transport via pipelines","Inland freight water transport","Medium","Medium","Medium","t125","Not yet drafted",null,{"$f":"IF($G265=Section,\nIF(COUNTIFS(P$22:P264,$H265)=0,$H265,0),\n0)","v":0},{"$f":"IF(AND($G265=Section,$H265=Category),\nIF(COUNTIFS(Q$22:Q264,$I265)=0,$I265,0),\n0)","v":0},null,null,{"$f":"IFERROR(\nINDEX(OFFSET(P264,MATCH(\"\"&T264,P264:P$339,0),0):P$339,MATCH(\"*\",OFFSET(P264,MATCH(\"\"&T264,P264:P$339,0),0):P$339,0)),\n0)","v":0},{"$f":"IFERROR(\nINDEX(OFFSET(Q264,MATCH(\"\"&U264,Q264:Q$339,0),0):Q$339,MATCH(\"*\",OFFSET(Q264,MATCH(\"\"&U264,Q264:Q$339,0),0):Q$339,0)),\n0)","v":0}]
[null,null,null,null,"Transportation and StorageAir TransportPassenger air transport","51.1","Transportation and Storage","Air Transport","Passenger air transport","Low","Low","Low","[n/a]","[n/a]",null,{"$f":"IF($G266=Section,\nIF(COUNTIFS(P$22:P265,$H266)=0,$H266,0),\n0)","v":0},{"$f":"IF(AND($G266=Section,$H266=Category),\nIF(COUNTIFS(Q$22:Q265,$I266)=0,$I266,0),\n0)","v":0},null,null,{"$f":"IFERROR(\nINDEX(OFFSET(P265,MATCH(\"\"&T265,P265:P$339,0),0):P$339,MATCH(\"*\",OFFSET(P265,MATCH(\"\"&T265,P265:P$339,0),0):P$339,0)),\n0)","v":0},{"$f":"IFERROR(\nINDEX(OFFSET(Q265,MATCH(\"\"&U265,Q265:Q$339,0),0):Q$339,MATCH(\"*\",OFFSET(Q265,MATCH(\"\"&U265,Q265:Q$339,0),0):Q$339,0)),\n0)","v":0}]
[null,null,null,null,"Transportation and StorageAir TransportFreight air transport","51.21","Transportation and Storage","Air Transport","Freight air transport","Low","Low","Low","[n/a]","[n/a]",null,{"$f":"IF($G267=Section,\nIF(COUNTIFS(P$22:P266,$H267)=0,$H267,0),\n0)","v":0},{"$f":"IF(AND($G267=Section,$H267=Category),\nIF(COUNTIFS(Q$22:Q266,$I267)=0,$I267,0),\n0)","v":0},null,null,{"$f":"IFERROR(\nINDEX(OFFSET(P266,MATCH(\"\"&T266,P266:P$339,0),0):P$339,MATCH(\"*\",OFFSET(P266,MATCH(\"\"&T266,P266:P$339,0),0):P$339,0)),\n0)","v":0},{"$f":"IFERROR(\nINDEX(OFFSET(Q266,MATCH(\"\"&U266,Q266:Q$339,0),0):Q$339,MATCH(\"*\",OFFSET(Q266,MATCH(\"\"&U266,Q266:Q$339,0),0):Q$339,0)),\n0)","v":0}]
[null,null,null,null,"Transportation and StorageAir TransportSpace transport","51.22","Transportation and Storage","Air Transport","Space transport","Medium","High","High","t38","Not yet drafted",null,{"$f":"IF($G268=Section,\nIF(COUNTIFS(P$22:P267,$H268)=0,$H268,0),\n0)","v":0},{"$f":"IF(AND($G268=Section,$H268=Category),\nIF(COUNTIFS(Q$22:Q267,$I268)=0,$I268,0),\n0)","v":0},null,null,{"$f":"IFERROR(\nINDEX(OFFSET(P267,MATCH(\"\"&T267,P267:P$339,0),0):P$339,MATCH(\"*\",OFFSET(P267,MATCH(\"\"&T267,P267:P$339,0),0):P$339,0)),\n0)","v":0},{"$f":"IFERROR(\nINDEX(OFFSET(Q267,MATCH(\"\"&U267,Q267:Q$339,0),0):Q$339,MATCH(\"*\",OFFSET(Q267,MATCH(\"\"&U267,Q267:Q$339,0),0):Q$339,0)),\n0)","v":0}]
[null,null,null,null,"Transportation and StorageWarehousing and support activities for transportation[n/a]","52","Transportation and Storage","Warehousing and support activities for transportation","[n/a]","Medium","Medium","Medium","t40","Not yet drafted",null,{"$f":"IF($G269=Section,\nIF(COUNTIFS(P$22:P268,$H269)=0,$H269,0),\n0)","v":0},{"$f":"IF(AND($G269=Section,$H269=Category),\nIF(COUNTIFS(Q$22:Q268,$I269)=0,$I269,0),\n0)","v":0},null,null,{"$f":"IFERROR(\nINDEX(OFFSET(P268,MATCH(\"\"&T268,P268:P$339,0),0):P$339,MATCH(\"*\",OFFSET(P268,MATCH(\"\"&T268,P268:P$339,0),0):P$339,0)),\n0)","v":0},{"$f":"IFERROR(\nINDEX(OFFSET(Q268,MATCH(\"\"&U268,Q268:Q$339,0),0):Q$339,MATCH(\"*\",OFFSET(Q268,MATCH(\"\"&U268,Q268:Q$339,0),0):Q$339,0)),\n0)","v":0}]
[null,null,null,null,"Transportation and StoragePostal and courier activities[n/a]","53","Transportation and Storage","Postal and courier activities","[n/a]","Low","Low","Low","[n/a]","[n/a]",null,{"$f":"IF($G270=Section,\nIF(COUNTIFS(P$22:P269,$H270)=0,$H270,0),\n0)","v":0},{"$f":"IF(AND($G270=Section,$H270=Category),\nIF(COUNTIFS(Q$22:Q269,$I270)=0,$I270,0),\n0)","v":0},null,null,{"$f":"IFERROR(\nINDEX(OFFSET(P269,MATCH(\"\"&T269,P269:P$339,0),0):P$339,MATCH(\"*\",OFFSET(P269,MATCH(\"\"&T269,P269:P$339,0),0):P$339,0)),\n0)","v":0},{"$f":"IFERROR(\nINDEX(OFFSET(Q269,MATCH(\"\"&U269,Q269:Q$339,0),0):Q$339,MATCH(\"*\",OFFSET(Q269,MATCH(\"\"&U269,Q269:Q$339,0),0):Q$339,0)),\n0)","v":0}]
[null,null,null,null,"Accommodation and food service activitiesAccommodation (incl. hotels, motels, holiday homes, youth hostels, cottages and cabins, camping grounds, recreational vehicle parks, etc.)[n/a]","55","Accommodation and food service activities","Accommodation (incl. hotels, motels, holiday homes, youth hostels, cottages and cabins, camping grounds, recreational vehicle parks, etc.)","[n/a]","Low","Medium","Medium","t126","Not yet drafted",null,{"$f":"IF($G271=Section,\nIF(COUNTIFS(P$22:P270,$H271)=0,$H271,0),\n0)","v":0},{"$f":"IF(AND($G271=Section,$H271=Category),\nIF(COUNTIFS(Q$22:Q270,$I271)=0,$I271,0),\n0)","v":0},null,null,{"$f":"IFERROR(\nINDEX(OFFSET(P270,MATCH(\"\"&T270,P270:P$339,0),0):P$339,MATCH(\"*\",OFFSET(P270,MATCH(\"\"&T270,P270:P$339,0),0):P$339,0)),\n0)","v":0},{"$f":"IFERROR(\nINDEX(OFFSET(Q270,MATCH(\"\"&U270,Q270:Q$339,0),0):Q$339,MATCH(\"*\",OFFSET(Q270,MATCH(\"\"&U270,Q270:Q$339,0),0):Q$339,0)),\n0)","v":0}]
[null,null,null,null,"Accommodation and food service activitiesFood and beverage service activities (restaurants and bars)[n/a]","56","Accommodation and food service activities","Food and beverage service activities (restaurants and bars)","[n/a]","Low","Medium","Medium","t124","Not yet drafted",null,{"$f":"IF($G272=Section,\nIF(COUNTIFS(P$22:P271,$H272)=0,$H272,0),\n0)","v":0},{"$f":"IF(AND($G272=Section,$H272=Category),\nIF(COUNTIFS(Q$22:Q271,$I272)=0,$I272,0),\n0)","v":0},null,null,{"$f":"IFERROR(\nINDEX(OFFSET(P271,MATCH(\"\"&T271,P271:P$339,0),0):P$339,MATCH(\"*\",OFFSET(P271,MATCH(\"\"&T271,P271:P$339,0),0):P$339,0)),\n0)","v":0},{"$f":"IFERROR(\nINDEX(OFFSET(Q271,MATCH(\"\"&U271,Q271:Q$339,0),0):Q$339,MATCH(\"*\",OFFSET(Q271,MATCH(\"\"&U271,Q271:Q$339,0),0):Q$339,0)),\n0)","v":0}]
[null,null,null,null,"Information and communicationPublishing activities[n/a]","58","Information and communication","Publishing activities","[n/a]","Low","Low","Low","[n/a]","[n/a]",null,{"$f":"IF($G273=Section,\nIF(COUNTIFS(P$22:P272,$H273)=0,$H273,0),\n0)","v":0},{"$f":"IF(AND($G273=Section,$H273=Category),\nIF(COUNTIFS(Q$22:Q272,$I273)=0,$I273,0),\n0)","v":0},null,null,{"$f":"IFERROR(\nINDEX(OFFSET(P272,MATCH(\"\"&T272,P272:P$339,0),0):P$339,MATCH(\"*\",OFFSET(P272,MATCH(\"\"&T272,P272:P$339,0),0):P$339,0)),\n0)","v":0},{"$f":"IFERROR(\nINDEX(OFFSET(Q272,MATCH(\"\"&U272,Q272:Q$339,0),0):Q$339,MATCH(\"*\",OFFSET(Q272,MATCH(\"\"&U272,Q272:Q$339,0),0):Q$339,0)),\n0)","v":0}]
[null,null,null,null,"Information and communicationMotion picture, video and television programme production, sound recording and music publishing activities[n/a]","59","Information and communication","Motion picture, video and television programme production, sound recording and music publishing activities","[n/a]","Low","Low","Low","[n/a]","[n/a]",null,{"$f":"IF($G274=Section,\nIF(COUNTIFS(P$22:P273,$H274)=0,$H274,0),\n0)","v":0},{"$f":"IF(AND($G274=Section,$H274=Category),\nIF(COUNTIFS(Q$22:Q273,$I274)=0,$I274,0),\n0)","v":0},null,null,{"$f":"IFERROR(\nINDEX(OFFSET(P273,MATCH(\"\"&T273,P273:P$339,0),0):P$339,MATCH(\"*\",OFFSET(P273,MATCH(\"\"&T273,P273:P$339,0),0):P$339,0)),\n0)","v":0},{"$f":"IFERROR(\nINDEX(OFFSET(Q273,MATCH(\"\"&U273,Q273:Q$339,0),0):Q$339,MATCH(\"*\",OFFSET(Q273,MATCH(\"\"&U273,Q273:Q$339,0),0):Q$339,0)),\n0)","v":0}]
[null,null,null,null,"Information and communicationProgramming and broadcasting activities[n/a]","60","Information and communication","Programming and broadcasting activities","[n/a]","Low","Low","Low","[n/a]","[n/a]",null,{"$f":"IF($G275=Section,\nIF(COUNTIFS(P$22:P274,$H275)=0,$H275,0),\n0)","v":0},{"$f":"IF(AND($G275=Section,$H275=Category),\nIF(COUNTIFS(Q$22:Q274,$I275)=0,$I275,0),\n0)","v":0},null,null,{"$f":"IFERROR(\nINDEX(OFFSET(P274,MATCH(\"\"&T274,P274:P$339,0),0):P$339,MATCH(\"*\",OFFSET(P274,MATCH(\"\"&T274,P274:P$339,0),0):P$339,0)),\n0)","v":0},{"$f":"IFERROR(\nINDEX(OFFSET(Q274,MATCH(\"\"&U274,Q274:Q$339,0),0):Q$339,MATCH(\"*\",OFFSET(Q274,MATCH(\"\"&U274,Q274:Q$339,0),0):Q$339,0)),\n0)","v":0}]
[null,null,null,null,"Information and communicationTelecommunications[n/a]","61","Information and communication","Telecommunications","[n/a]","Low","Medium","Medium","t58","Not yet drafted",null,{"$f":"IF($G276=Section,\nIF(COUNTIFS(P$22:P275,$H276)=0,$H276,0),\n0)","v":0},{"$f":"IF(AND($G276=Section,$H276=Category),\nIF(COUNTIFS(Q$22:Q275,$I276)=0,$I276,0),\n0)","v":0},null,null,{"$f":"IFERROR(\nINDEX(OFFSET(P275,MATCH(\"\"&T275,P275:P$339,0),0):P$339,MATCH(\"*\",OFFSET(P275,MATCH(\"\"&T275,P275:P$339,0),0):P$339,0)),\n0)","v":0},{"$f":"IFERROR(\nINDEX(OFFSET(Q275,MATCH(\"\"&U275,Q275:Q$339,0),0):Q$339,MATCH(\"*\",OFFSET(Q275,MATCH(\"\"&U275,Q275:Q$339,0),0):Q$339,0)),\n0)","v":0}]
[null,null,null,null,"Information and communicationComputer programming, consultancy and related activities[n/a]","62","Information and communication","Computer programming, consultancy and related activities","[n/a]","Low","Low","Low","[n/a]","[n/a]",null,{"$f":"IF($G277=Section,\nIF(COUNTIFS(P$22:P276,$H277)=0,$H277,0),\n0)","v":0},{"$f":"IF(AND($G277=Section,$H277=Category),\nIF(COUNTIFS(Q$22:Q276,$I277)=0,$I277,0),\n0)","v":0},null,null,{"$f":"IFERROR(\nINDEX(OFFSET(P276,MATCH(\"\"&T276,P276:P$339,0),0):P$339,MATCH(\"*\",OFFSET(P276,MATCH(\"\"&T276,P276:P$339,0),0):P$339,0)),\n0)","v":0},{"$f":"IFERROR(\nINDEX(OFFSET(Q276,MATCH(\"\"&U276,Q276:Q$339,0),0):Q$339,MATCH(\"*\",OFFSET(Q276,MATCH(\"\"&U276,Q276:Q$339,0),0):Q$339,0)),\n0)","v":0}]
[null,null,null,null,"Information and communicationInformation service activities[n/a]","63","Information and communication","Information service activities","[n/a]","Low","Low","Low","[n/a]","[n/a]",null,{"$f":"IF($G278=Section,\nIF(COUNTIFS(P$22:P277,$H278)=0,$H278,0),\n0)","v":0},{"$f":"IF(AND($G278=Section,$H278=Category),\nIF(COUNTIFS(Q$22:Q277,$I278)=0,$I278,0),\n0)","v":0},null,null,{"$f":"IFERROR(\nINDEX(OFFSET(P277,MATCH(\"\"&T277,P277:P$339,0),0):P$339,MATCH(\"*\",OFFSET(P277,MATCH(\"\"&T277,P277:P$339,0),0):P$339,0)),\n0)","v":0},{"$f":"IFERROR(\nINDEX(OFFSET(Q277,MATCH(\"\"&U277,Q277:Q$339,0),0):Q$339,MATCH(\"*\",OFFSET(Q277,MATCH(\"\"&U277,Q277:Q$339,0),0):Q$339,0)),\n0)","v":0}]
[null,null,null,null,{"$f":"G279&H279&I279","v":"Financial and insurance activitiesFinancial service activities, except insurance and pension funding[n/a]"},"64","Financial and insurance activities","Financial service activities, except insurance and pension funding","[n/a]","Low","Low","Low","[n/a]","[n/a]",null,{"$f":"IF($G279=Section,\nIF(COUNTIFS(P$22:P278,$H279)=0,$H279,0),\n0)","v":0},{"$f":"IF(AND($G279=Section,$H279=Category),\nIF(COUNTIFS(Q$22:Q278,$I279)=0,$I279,0),\n0)","v":0},null,null,{"$f":"IFERROR(\nINDEX(OFFSET(P278,MATCH(\"\"&T278,P278:P$339,0),0):P$339,MATCH(\"*\",OFFSET(P278,MATCH(\"\"&T278,P278:P$339,0),0):P$339,0)),\n0)","v":0},{"$f":"IFERROR(\nINDEX(OFFSET(Q278,MATCH(\"\"&U278,Q278:Q$339,0),0):Q$339,MATCH(\"*\",OFFSET(Q278,MATCH(\"\"&U278,Q278:Q$339,0),0):Q$339,0)),\n0)","v":0}]
[null,null,null,null,"Financial and insurance activitiesInsurance, reinsurance and pension funding, except compulsory social security[n/a]","65","Financial and insurance activities","Insurance, reinsurance and pension funding, except compulsory social security","[n/a]","Low","Low","Low","[n/a]","[n/a]",null,{"$f":"IF($G280=Section,\nIF(COUNTIFS(P$22:P279,$H280)=0,$H280,0),\n0)","v":0},{"$f":"IF(AND($G280=Section,$H280=Category),\nIF(COUNTIFS(Q$22:Q279,$I280)=0,$I280,0),\n0)","v":0},null,null,{"$f":"IFERROR(\nINDEX(OFFSET(P279,MATCH(\"\"&T279,P279:P$339,0),0):P$339,MATCH(\"*\",OFFSET(P279,MATCH(\"\"&T279,P279:P$339,0),0):P$339,0)),\n0)","v":0},{"$f":"IFERROR(\nINDEX(OFFSET(Q279,MATCH(\"\"&U279,Q279:Q$339,0),0):Q$339,MATCH(\"*\",OFFSET(Q279,MATCH(\"\"&U279,Q279:Q$339,0),0):Q$339,0)),\n0)","v":0}]
[null,null,null,null,"Financial and insurance activitiesActivities auxiliary to financial services and insurance activities[n/a]","66","Financial and insurance activities","Activities auxiliary to financial services and insurance activities","[n/a]","Low","Low","Low","[n/a]","[n/a]",null,{"$f":"IF($G281=Section,\nIF(COUNTIFS(P$22:P280,$H281)=0,$H281,0),\n0)","v":0},{"$f":"IF(AND($G281=Section,$H281=Category),\nIF(COUNTIFS(Q$22:Q280,$I281)=0,$I281,0),\n0)","v":0},null,null,{"$f":"IFERROR(\nINDEX(OFFSET(P280,MATCH(\"\"&T280,P280:P$339,0),0):P$339,MATCH(\"*\",OFFSET(P280,MATCH(\"\"&T280,P280:P$339,0),0):P$339,0)),\n0)","v":0},{"$f":"IFERROR(\nINDEX(OFFSET(Q280,MATCH(\"\"&U280,Q280:Q$339,0),0):Q$339,MATCH(\"*\",OFFSET(Q280,MATCH(\"\"&U280,Q280:Q$339,0),0):Q$339,0)),\n0)","v":0}]
[null,null,null,null,"Real estate activitiesReal estate activitiesReal estate activities n.e.c.","68","Real estate activities","Real estate activities","Real estate activities n.e.c.","Low","Low","Low","[n/a]","[n/a]",null,{"$f":"IF($G282=Section,\nIF(COUNTIFS(P$22:P281,$H282)=0,$H282,0),\n0)","v":0},{"$f":"IF(AND($G282=Section,$H282=Category),\nIF(COUNTIFS(Q$22:Q281,$I282)=0,$I282,0),\n0)","v":0},null,null,{"$f":"IFERROR(\nINDEX(OFFSET(P281,MATCH(\"\"&T281,P281:P$339,0),0):P$339,MATCH(\"*\",OFFSET(P281,MATCH(\"\"&T281,P281:P$339,0),0):P$339,0)),\n0)","v":0},{"$f":"IFERROR(\nINDEX(OFFSET(Q281,MATCH(\"\"&U281,Q281:Q$339,0),0):Q$339,MATCH(\"*\",OFFSET(Q281,MATCH(\"\"&U281,Q281:Q$339,0),0):Q$339,0)),\n0)","v":0}]
[null,null,null,null,"Real estate activitiesReal estate activitiesRenting and operating of own or leased real estate","68.2","Real estate activities","Real estate activities","Renting and operating of own or leased real estate","Medium","Medium","Medium","t61","Not yet drafted",null,{"$f":"IF($G283=Section,\nIF(COUNTIFS(P$22:P282,$H283)=0,$H283,0),\n0)","v":0},{"$f":"IF(AND($G283=Section,$H283=Category),\nIF(COUNTIFS(Q$22:Q282,$I283)=0,$I283,0),\n0)","v":0},null,null,{"$f":"IFERROR(\nINDEX(OFFSET(P282,MATCH(\"\"&T282,P282:P$339,0),0):P$339,MATCH(\"*\",OFFSET(P282,MATCH(\"\"&T282,P282:P$339,0),0):P$339,0)),\n0)","v":0},{"$f":"IFERROR(\nINDEX(OFFSET(Q282,MATCH(\"\"&U282,Q282:Q$339,0),0):Q$339,MATCH(\"*\",OFFSET(Q282,MATCH(\"\"&U282,Q282:Q$339,0),0):Q$339,0)),\n0)","v":0}]
[null,null,null,null,"Real estate activitiesReal estate activitiesManagement of real estate on a fee or contract basis","68.32","Real estate activities","Real estate activities","Management of real estate on a fee or contract basis","Low","Low","Low","t61","Not yet drafted",null,{"$f":"IF($G284=Section,\nIF(COUNTIFS(P$22:P283,$H284)=0,$H284,0),\n0)","v":0},{"$f":"IF(AND($G284=Section,$H284=Category),\nIF(COUNTIFS(Q$22:Q283,$I284)=0,$I284,0),\n0)","v":0},null,null,{"$f":"IFERROR(\nINDEX(OFFSET(P283,MATCH(\"\"&T283,P283:P$339,0),0):P$339,MATCH(\"*\",OFFSET(P283,MATCH(\"\"&T283,P283:P$339,0),0):P$339,0)),\n0)","v":0},{"$f":"IFERROR(\nINDEX(OFFSET(Q283,MATCH(\"\"&U283,Q283:Q$339,0),0):Q$339,MATCH(\"*\",OFFSET(Q283,MATCH(\"\"&U283,Q283:Q$339,0),0):Q$339,0)),\n0)","v":0}]
[null,null,null,null,"Professional scientific and technical activitiesLegal and accounting activities[n/a]","69","Professional scientific and technical activities","Legal and accounting activities","[n/a]","Low","Low","Low","[n/a]","[n/a]",null,{"$f":"IF($G285=Section,\nIF(COUNTIFS(P$22:P284,$H285)=0,$H285,0),\n0)","v":0},{"$f":"IF(AND($G285=Section,$H285=Category),\nIF(COUNTIFS(Q$22:Q284,$I285)=0,$I285,0),\n0)","v":0},null,null,{"$f":"IFERROR(\nINDEX(OFFSET(P284,MATCH(\"\"&T284,P284:P$339,0),0):P$339,MATCH(\"*\",OFFSET(P284,MATCH(\"\"&T284,P284:P$339,0),0):P$339,0)),\n0)","v":0},{"$f":"IFERROR(\nINDEX(OFFSET(Q284,MATCH(\"\"&U284,Q284:Q$339,0),0):Q$339,MATCH(\"*\",OFFSET(Q284,MATCH(\"\"&U284,Q284:Q$339,0),0):Q$339,0)),\n0)","v":0}]
[null,null,null,null,"Professional scientific and technical activitiesActivities of head offices; management consultancy activities[n/a]","70","Professional scientific and technical activities","Activities of head offices; management consultancy activities","[n/a]","Low","Low","Low","[n/a]","[n/a]",null,{"$f":"IF($G286=Section,\nIF(COUNTIFS(P$22:P285,$H286)=0,$H286,0),\n0)","v":0},{"$f":"IF(AND($G286=Section,$H286=Category),\nIF(COUNTIFS(Q$22:Q285,$I286)=0,$I286,0),\n0)","v":0},null,null,{"$f":"IFERROR(\nINDEX(OFFSET(P285,MATCH(\"\"&T285,P285:P$339,0),0):P$339,MATCH(\"*\",OFFSET(P285,MATCH(\"\"&T285,P285:P$339,0),0):P$339,0)),\n0)","v":0},{"$f":"IFERROR(\nINDEX(OFFSET(Q285,MATCH(\"\"&U285,Q285:Q$339,0),0):Q$339,MATCH(\"*\",OFFSET(Q285,MATCH(\"\"&U285,Q285:Q$339,0),0):Q$339,0)),\n0)","v":0}]
[null,null,null,null,"Professional scientific and technical activitiesArchitectural and engineering activities; technical testing and analysis[n/a]","71","Professional scientific and technical activities","Architectural and engineering activities; technical testing and analysis","[n/a]","Low","Low","Low","[n/a]","[n/a]",null,{"$f":"IF($G287=Section,\nIF(COUNTIFS(P$22:P286,$H287)=0,$H287,0),\n0)","v":0},{"$f":"IF(AND($G287=Section,$H287=Category),\nIF(COUNTIFS(Q$22:Q286,$I287)=0,$I287,0),\n0)","v":0},null,null,{"$f":"IFERROR(\nINDEX(OFFSET(P286,MATCH(\"\"&T286,P286:P$339,0),0):P$339,MATCH(\"*\",OFFSET(P286,MATCH(\"\"&T286,P286:P$339,0),0):P$339,0)),\n0)","v":0},{"$f":"IFERROR(\nINDEX(OFFSET(Q286,MATCH(\"\"&U286,Q286:Q$339,0),0):Q$339,MATCH(\"*\",OFFSET(Q286,MATCH(\"\"&U286,Q286:Q$339,0),0):Q$339,0)),\n0)","v":0}]
[null,null,null,null,"Professional scientific and technical activitiesScientific research and development[n/a]","72","Professional scientific and technical activities","Scientific research and development","[n/a]","Low","Low","Low","[n/a]","[n/a]",null,{"$f":"IF($G288=Section,\nIF(COUNTIFS(P$22:P287,$H288)=0,$H288,0),\n0)","v":0},{"$f":"IF(AND($G288=Section,$H288=Category),\nIF(COUNTIFS(Q$22:Q287,$I288)=0,$I288,0),\n0)","v":0},null,null,{"$f":"IFERROR(\nINDEX(OFFSET(P287,MATCH(\"\"&T287,P287:P$339,0),0):P$339,MATCH(\"*\",OFFSET(P287,MATCH(\"\"&T287,P287:P$339,0),0):P$339,0)),\n0)","v":0},{"$f":"IFERROR(\nINDEX(OFFSET(Q287,MATCH(\"\"&U287,Q287:Q$339,0),0):Q$339,MATCH(\"*\",OFFSET(Q287,MATCH(\"\"&U287,Q287:Q$339,0),0):Q$339,0)),\n0)","v":0}]
[null,null,null,null,"Professional scientific and technical activitiesAdvertising and market research[n/a]","73","Professional scientific and technical activities","Advertising and market research","[n/a]","Low","Low","Low","[n/a]","[n/a]",null,{"$f":"IF($G289=Section,\nIF(COUNTIFS(P$22:P288,$H289)=0,$H289,0),\n0)","v":0},{"$f":"IF(AND($G289=Section,$H289=Category),\nIF(COUNTIFS(Q$22:Q288,$I289)=0,$I289,0),\n0)","v":0},null,null,{"$f":"IFERROR(\nINDEX(OFFSET(P288,MATCH(\"\"&T288,P288:P$339,0),0):P$339,MATCH(\"*\",OFFSET(P288,MATCH(\"\"&T288,P288:P$339,0),0):P$339,0)),\n0)","v":0},{"$f":"IFERROR(\nINDEX(OFFSET(Q288,MATCH(\"\"&U288,Q288:Q$339,0),0):Q$339,MATCH(\"*\",OFFSET(Q288,MATCH(\"\"&U288,Q288:Q$339,0),0):Q$339,0)),\n0)","v":0}]
[null,null,null,null,"Professional scientific and technical activitiesOther professional, scientific and technical activities[n/a]","74","Professional scientific and technical activities","Other professional, scientific and technical activities","[n/a]","Low","Low","Low","[n/a]","[n/a]",null,{"$f":"IF($G290=Section,\nIF(COUNTIFS(P$22:P289,$H290)=0,$H290,0),\n0)","v":0},{"$f":"IF(AND($G290=Section,$H290=Category),\nIF(COUNTIFS(Q$22:Q289,$I290)=0,$I290,0),\n0)","v":0},null,null,{"$f":"IFERROR(\nINDEX(OFFSET(P289,MATCH(\"\"&T289,P289:P$339,0),0):P$339,MATCH(\"*\",OFFSET(P289,MATCH(\"\"&T289,P289:P$339,0),0):P$339,0)),\n0)","v":0},{"$f":"IFERROR(\nINDEX(OFFSET(Q289,MATCH(\"\"&U289,Q289:Q$339,0),0):Q$339,MATCH(\"*\",OFFSET(Q289,MATCH(\"\"&U289,Q289:Q$339,0),0):Q$339,0)),\n0)","v":0}]
[null,null,null,null,"Professional scientific and technical activitiesVeterinary activities[n/a]","75","Professional scientific and technical activities","Veterinary activities","[n/a]","Low","Low","Low","[n/a]","[n/a]",null,{"$f":"IF($G291=Section,\nIF(COUNTIFS(P$22:P290,$H291)=0,$H291,0),\n0)","v":0},{"$f":"IF(AND($G291=Section,$H291=Category),\nIF(COUNTIFS(Q$22:Q290,$I291)=0,$I291,0),\n0)","v":0},null,null,{"$f":"IFERROR(\nINDEX(OFFSET(P290,MATCH(\"\"&T290,P290:P$339,0),0):P$339,MATCH(\"*\",OFFSET(P290,MATCH(\"\"&T290,P290:P$339,0),0):P$339,0)),\n0)","v":0},{"$f":"IFERROR(\nINDEX(OFFSET(Q290,MATCH(\"\"&U290,Q290:Q$339,0),0):Q$339,MATCH(\"*\",OFFSET(Q290,MATCH(\"\"&U290,Q290:Q$339,0),0):Q$339,0)),\n0)","v":0}]
[null,null,null,null,"Administrative and support service activitiesRental and leasing activitiesRenting and leasing of cars and light motor vehicles","77.11","Administrative and support service activities","Rental and leasing activities","Renting and leasing of cars and light motor vehicles","Low","Low","Low","[n/a]","[n/a]",null,{"$f":"IF($G292=Section,\nIF(COUNTIFS(P$22:P291,$H292)=0,$H292,0),\n0)","v":0},{"$f":"IF(AND($G292=Section,$H292=Category),\nIF(COUNTIFS(Q$22:Q291,$I292)=0,$I292,0),\n0)","v":0},null,null,{"$f":"IFERROR(\nINDEX(OFFSET(P291,MATCH(\"\"&T291,P291:P$339,0),0):P$339,MATCH(\"*\",OFFSET(P291,MATCH(\"\"&T291,P291:P$339,0),0):P$339,0)),\n0)","v":0},{"$f":"IFERROR(\nINDEX(OFFSET(Q291,MATCH(\"\"&U291,Q291:Q$339,0),0):Q$339,MATCH(\"*\",OFFSET(Q291,MATCH(\"\"&U291,Q291:Q$339,0),0):Q$339,0)),\n0)","v":0}]
[null,null,null,null,"Administrative and support service activitiesRental and leasing activitiesRenting and leasing of trucks","77.12","Administrative and support service activities","Rental and leasing activities","Renting and leasing of trucks","Low","Medium","Medium","t61","Not yet drafted",null,{"$f":"IF($G293=Section,\nIF(COUNTIFS(P$22:P292,$H293)=0,$H293,0),\n0)","v":0},{"$f":"IF(AND($G293=Section,$H293=Category),\nIF(COUNTIFS(Q$22:Q292,$I293)=0,$I293,0),\n0)","v":0},null,null,{"$f":"IFERROR(\nINDEX(OFFSET(P292,MATCH(\"\"&T292,P292:P$339,0),0):P$339,MATCH(\"*\",OFFSET(P292,MATCH(\"\"&T292,P292:P$339,0),0):P$339,0)),\n0)","v":0},{"$f":"IFERROR(\nINDEX(OFFSET(Q292,MATCH(\"\"&U292,Q292:Q$339,0),0):Q$339,MATCH(\"*\",OFFSET(Q292,MATCH(\"\"&U292,Q292:Q$339,0),0):Q$339,0)),\n0)","v":0}]
[null,null,null,null,"Administrative and support service activitiesRental and leasing activitiesRenting and leasing of recreational and sports goods","77.21","Administrative and support service activities","Rental and leasing activities","Renting and leasing of recreational and sports goods","Low","Low","Low","[n/a]","[n/a]",null,{"$f":"IF($G294=Section,\nIF(COUNTIFS(P$22:P293,$H294)=0,$H294,0),\n0)","v":0},{"$f":"IF(AND($G294=Section,$H294=Category),\nIF(COUNTIFS(Q$22:Q293,$I294)=0,$I294,0),\n0)","v":0},null,null,{"$f":"IFERROR(\nINDEX(OFFSET(P293,MATCH(\"\"&T293,P293:P$339,0),0):P$339,MATCH(\"*\",OFFSET(P293,MATCH(\"\"&T293,P293:P$339,0),0):P$339,0)),\n0)","v":0},{"$f":"IFERROR(\nINDEX(OFFSET(Q293,MATCH(\"\"&U293,Q293:Q$339,0),0):Q$339,MATCH(\"*\",OFFSET(Q293,MATCH(\"\"&U293,Q293:Q$339,0),0):Q$339,0)),\n0)","v":0}]
[null,null,null,null,"Administrative and support service activitiesRental and leasing activitiesRenting of video tapes and disks","77.22","Administrative and support service activities","Rental and leasing activities","Renting of video tapes and disks","Low","Low","Low","[n/a]","[n/a]",null,{"$f":"IF($G295=Section,\nIF(COUNTIFS(P$22:P294,$H295)=0,$H295,0),\n0)","v":0},{"$f":"IF(AND($G295=Section,$H295=Category),\nIF(COUNTIFS(Q$22:Q294,$I295)=0,$I295,0),\n0)","v":0},null,null,{"$f":"IFERROR(\nINDEX(OFFSET(P294,MATCH(\"\"&T294,P294:P$339,0),0):P$339,MATCH(\"*\",OFFSET(P294,MATCH(\"\"&T294,P294:P$339,0),0):P$339,0)),\n0)","v":0},{"$f":"IFERROR(\nINDEX(OFFSET(Q294,MATCH(\"\"&U294,Q294:Q$339,0),0):Q$339,MATCH(\"*\",OFFSET(Q294,MATCH(\"\"&U294,Q294:Q$339,0),0):Q$339,0)),\n0)","v":0}]
[null,null,null,null,"Administrative and support service activitiesRental and leasing activitiesRenting and leasing of other personal and household goods","77.29","Administrative and support service activities","Rental and leasing activities","Renting and leasing of other personal and household goods","Low","Low","Low","[n/a]","[n/a]",null,{"$f":"IF($G296=Section,\nIF(COUNTIFS(P$22:P295,$H296)=0,$H296,0),\n0)","v":0},{"$f":"IF(AND($G296=Section,$H296=Category),\nIF(COUNTIFS(Q$22:Q295,$I296)=0,$I296,0),\n0)","v":0},null,null,{"$f":"IFERROR(\nINDEX(OFFSET(P295,MATCH(\"\"&T295,P295:P$339,0),0):P$339,MATCH(\"*\",OFFSET(P295,MATCH(\"\"&T295,P295:P$339,0),0):P$339,0)),\n0)","v":0},{"$f":"IFERROR(\nINDEX(OFFSET(Q295,MATCH(\"\"&U295,Q295:Q$339,0),0):Q$339,MATCH(\"*\",OFFSET(Q295,MATCH(\"\"&U295,Q295:Q$339,0),0):Q$339,0)),\n0)","v":0}]
[null,null,null,null,"Administrative and support service activitiesRental and leasing activitiesRenting and leasing of agricultural machinery and equipment","77.31","Administrative and support service activities","Rental and leasing activities","Renting and leasing of agricultural machinery and equipment","Low","Medium","Medium","t61","Not yet drafted",null,{"$f":"IF($G297=Section,\nIF(COUNTIFS(P$22:P296,$H297)=0,$H297,0),\n0)","v":0},{"$f":"IF(AND($G297=Section,$H297=Category),\nIF(COUNTIFS(Q$22:Q296,$I297)=0,$I297,0),\n0)","v":0},null,null,{"$f":"IFERROR(\nINDEX(OFFSET(P296,MATCH(\"\"&T296,P296:P$339,0),0):P$339,MATCH(\"*\",OFFSET(P296,MATCH(\"\"&T296,P296:P$339,0),0):P$339,0)),\n0)","v":0},{"$f":"IFERROR(\nINDEX(OFFSET(Q296,MATCH(\"\"&U296,Q296:Q$339,0),0):Q$339,MATCH(\"*\",OFFSET(Q296,MATCH(\"\"&U296,Q296:Q$339,0),0):Q$339,0)),\n0)","v":0}]
[null,null,null,null,"Administrative and support service activitiesRental and leasing activitiesRenting and leasing of construction and civil engineering machinery and equipment","77.32","Administrative and support service activities","Rental and leasing activities","Renting and leasing of construction and civil engineering machinery and equipment","Low","Medium","Medium","t61","Not yet drafted",null,{"$f":"IF($G298=Section,\nIF(COUNTIFS(P$22:P297,$H298)=0,$H298,0),\n0)","v":0},{"$f":"IF(AND($G298=Section,$H298=Category),\nIF(COUNTIFS(Q$22:Q297,$I298)=0,$I298,0),\n0)","v":0},null,null,{"$f":"IFERROR(\nINDEX(OFFSET(P297,MATCH(\"\"&T297,P297:P$339,0),0):P$339,MATCH(\"*\",OFFSET(P297,MATCH(\"\"&T297,P297:P$339,0),0):P$339,0)),\n0)","v":0},{"$f":"IFERROR(\nINDEX(OFFSET(Q297,MATCH(\"\"&U297,Q297:Q$339,0),0):Q$339,MATCH(\"*\",OFFSET(Q297,MATCH(\"\"&U297,Q297:Q$339,0),0):Q$339,0)),\n0)","v":0}]
[null,null,null,null,"Administrative and support service activitiesRental and leasing activitiesRenting and leasing of office machinery and equipment (including computers)","77.33","Administrative and support service activities","Rental and leasing activities","Renting and leasing of office machinery and equipment (including computers)","Low","Low","Low","[n/a]","[n/a]",null,{"$f":"IF($G299=Section,\nIF(COUNTIFS(P$22:P298,$H299)=0,$H299,0),\n0)","v":0},{"$f":"IF(AND($G299=Section,$H299=Category),\nIF(COUNTIFS(Q$22:Q298,$I299)=0,$I299,0),\n0)","v":0},null,null,{"$f":"IFERROR(\nINDEX(OFFSET(P298,MATCH(\"\"&T298,P298:P$339,0),0):P$339,MATCH(\"*\",OFFSET(P298,MATCH(\"\"&T298,P298:P$339,0),0):P$339,0)),\n0)","v":0},{"$f":"IFERROR(\nINDEX(OFFSET(Q298,MATCH(\"\"&U298,Q298:Q$339,0),0):Q$339,MATCH(\"*\",OFFSET(Q298,MATCH(\"\"&U298,Q298:Q$339,0),0):Q$339,0)),\n0)","v":0}]
[null,null,null,null,"Administrative and support service activitiesRental and leasing activitiesRenting and leasing of water transport equipment","77.34","Administrative and support service activities","Rental and leasing activities","Renting and leasing of water transport equipment","Low","Medium","Medium","t61","Not yet drafted",null,{"$f":"IF($G300=Section,\nIF(COUNTIFS(P$22:P299,$H300)=0,$H300,0),\n0)","v":0},{"$f":"IF(AND($G300=Section,$H300=Category),\nIF(COUNTIFS(Q$22:Q299,$I300)=0,$I300,0),\n0)","v":0},null,null,{"$f":"IFERROR(\nINDEX(OFFSET(P299,MATCH(\"\"&T299,P299:P$339,0),0):P$339,MATCH(\"*\",OFFSET(P299,MATCH(\"\"&T299,P299:P$339,0),0):P$339,0)),\n0)","v":0},{"$f":"IFERROR(\nINDEX(OFFSET(Q299,MATCH(\"\"&U299,Q299:Q$339,0),0):Q$339,MATCH(\"*\",OFFSET(Q299,MATCH(\"\"&U299,Q299:Q$339,0),0):Q$339,0)),\n0)","v":0}]
[null,null,null,null,"Administrative and support service activitiesRental and leasing activitiesRenting and leasing of air transport equipment","77.35","Administrative and support service activities","Rental and leasing activities","Renting and leasing of air transport equipment","Low","Medium","Medium","t61","Not yet drafted",null,{"$f":"IF($G301=Section,\nIF(COUNTIFS(P$22:P300,$H301)=0,$H301,0),\n0)","v":0},{"$f":"IF(AND($G301=Section,$H301=Category),\nIF(COUNTIFS(Q$22:Q300,$I301)=0,$I301,0),\n0)","v":0},null,null,{"$f":"IFERROR(\nINDEX(OFFSET(P300,MATCH(\"\"&T300,P300:P$339,0),0):P$339,MATCH(\"*\",OFFSET(P300,MATCH(\"\"&T300,P300:P$339,0),0):P$339,0)),\n0)","v":0},{"$f":"IFERROR(\nINDEX(OFFSET(Q300,MATCH(\"\"&U300,Q300:Q$339,0),0):Q$339,MATCH(\"*\",OFFSET(Q300,MATCH(\"\"&U300,Q300:Q$339,0),0):Q$339,0)),\n0)","v":0}]
[null,null,null,null,"Administrative and support service activitiesRental and leasing activitiesRenting and leasing of other machinery, equipment and tangible goods not elsewhere classified","77.39","Administrative and support service activities","Rental and leasing activities","Renting and leasing of other machinery, equipment and tangible goods not elsewhere classified","Low","Medium","Medium","t61","Not yet drafted",null,{"$f":"IF($G302=Section,\nIF(COUNTIFS(P$22:P301,$H302)=0,$H302,0),\n0)","v":0},{"$f":"IF(AND($G302=Section,$H302=Category),\nIF(COUNTIFS(Q$22:Q301,$I302)=0,$I302,0),\n0)","v":0},null,null,{"$f":"IFERROR(\nINDEX(OFFSET(P301,MATCH(\"\"&T301,P301:P$339,0),0):P$339,MATCH(\"*\",OFFSET(P301,MATCH(\"\"&T301,P301:P$339,0),0):P$339,0)),\n0)","v":0},{"$f":"IFERROR(\nINDEX(OFFSET(Q301,MATCH(\"\"&U301,Q301:Q$339,0),0):Q$339,MATCH(\"*\",OFFSET(Q301,MATCH(\"\"&U301,Q301:Q$339,0),0):Q$339,0)),\n0)","v":0}]
[null,null,null,null,"Administrative and support service activitiesRental and leasing activitiesLeasing of intellectual property and similar products, except copy-righted works","77.4","Administrative and support service activities","Rental and leasing activities","Leasing of intellectual property and similar products, except copy-righted works","Low","Low","Low","[n/a]","[n/a]",null,{"$f":"IF($G303=Section,\nIF(COUNTIFS(P$22:P302,$H303)=0,$H303,0),\n0)","v":0},{"$f":"IF(AND($G303=Section,$H303=Category),\nIF(COUNTIFS(Q$22:Q302,$I303)=0,$I303,0),\n0)","v":0},null,null,{"$f":"IFERROR(\nINDEX(OFFSET(P302,MATCH(\"\"&T302,P302:P$339,0),0):P$339,MATCH(\"*\",OFFSET(P302,MATCH(\"\"&T302,P302:P$339,0),0):P$339,0)),\n0)","v":0},{"$f":"IFERROR(\nINDEX(OFFSET(Q302,MATCH(\"\"&U302,Q302:Q$339,0),0):Q$339,MATCH(\"*\",OFFSET(Q302,MATCH(\"\"&U302,Q302:Q$339,0),0):Q$339,0)),\n0)","v":0}]
[null,null,null,null,"Administrative and support service activitiesEmployment activitiesActivities of employment placement agencies","78.1","Administrative and support service activities","Employment activities","Activities of employment placement agencies","Low","Medium","Medium","t1","Not yet drafted",null,{"$f":"IF($G304=Section,\nIF(COUNTIFS(P$22:P303,$H304)=0,$H304,0),\n0)","v":0},{"$f":"IF(AND($G304=Section,$H304=Category),\nIF(COUNTIFS(Q$22:Q303,$I304)=0,$I304,0),\n0)","v":0},null,null,{"$f":"IFERROR(\nINDEX(OFFSET(P303,MATCH(\"\"&T303,P303:P$339,0),0):P$339,MATCH(\"*\",OFFSET(P303,MATCH(\"\"&T303,P303:P$339,0),0):P$339,0)),\n0)","v":0},{"$f":"IFERROR(\nINDEX(OFFSET(Q303,MATCH(\"\"&U303,Q303:Q$339,0),0):Q$339,MATCH(\"*\",OFFSET(Q303,MATCH(\"\"&U303,Q303:Q$339,0),0):Q$339,0)),\n0)","v":0}]
[null,null,null,null,"Administrative and support service activitiesEmployment activitiesTemporary employment agencies","78.2","Administrative and support service activities","Employment activities","Temporary employment agencies","Low","Medium","Medium","t2","Not yet drafted",null,{"$f":"IF($G305=Section,\nIF(COUNTIFS(P$22:P304,$H305)=0,$H305,0),\n0)","v":0},{"$f":"IF(AND($G305=Section,$H305=Category),\nIF(COUNTIFS(Q$22:Q304,$I305)=0,$I305,0),\n0)","v":0},null,null,{"$f":"IFERROR(\nINDEX(OFFSET(P304,MATCH(\"\"&T304,P304:P$339,0),0):P$339,MATCH(\"*\",OFFSET(P304,MATCH(\"\"&T304,P304:P$339,0),0):P$339,0)),\n0)","v":0},{"$f":"IFERROR(\nINDEX(OFFSET(Q304,MATCH(\"\"&U304,Q304:Q$339,0),0):Q$339,MATCH(\"*\",OFFSET(Q304,MATCH(\"\"&U304,Q304:Q$339,0),0):Q$339,0)),\n0)","v":0}]
[null,null,null,null,"Administrative and support service activitiesEmployment activitiesOther human resources provision","78.3","Administrative and support service activities","Employment activities","Other human resources provision","Low","Medium","Medium","t3","Not yet drafted",null,{"$f":"IF($G306=Section,\nIF(COUNTIFS(P$22:P305,$H306)=0,$H306,0),\n0)","v":0},{"$f":"IF(AND($G306=Section,$H306=Category),\nIF(COUNTIFS(Q$22:Q305,$I306)=0,$I306,0),\n0)","v":0},null,null,{"$f":"IFERROR(\nINDEX(OFFSET(P305,MATCH(\"\"&T305,P305:P$339,0),0):P$339,MATCH(\"*\",OFFSET(P305,MATCH(\"\"&T305,P305:P$339,0),0):P$339,0)),\n0)","v":0},{"$f":"IFERROR(\nINDEX(OFFSET(Q305,MATCH(\"\"&U305,Q305:Q$339,0),0):Q$339,MATCH(\"*\",OFFSET(Q305,MATCH(\"\"&U305,Q305:Q$339,0),0):Q$339,0)),\n0)","v":0}]
[null,null,null,null,"Administrative and support service activitiesTravel agency, tour operator reservation service and related activitiesTravel agency and tour operator activities","79.1","Administrative and support service activities","Travel agency, tour operator reservation service and related activities","Travel agency and tour operator activities","Low","Medium","Medium","t4","Not yet drafted",null,{"$f":"IF($G307=Section,\nIF(COUNTIFS(P$22:P306,$H307)=0,$H307,0),\n0)","v":0},{"$f":"IF(AND($G307=Section,$H307=Category),\nIF(COUNTIFS(Q$22:Q306,$I307)=0,$I307,0),\n0)","v":0},null,null,{"$f":"IFERROR(\nINDEX(OFFSET(P306,MATCH(\"\"&T306,P306:P$339,0),0):P$339,MATCH(\"*\",OFFSET(P306,MATCH(\"\"&T306,P306:P$339,0),0):P$339,0)),\n0)","v":0},{"$f":"IFERROR(\nINDEX(OFFSET(Q306,MATCH(\"\"&U306,Q306:Q$339,0),0):Q$339,MATCH(\"*\",OFFSET(Q306,MATCH(\"\"&U306,Q306:Q$339,0),0):Q$339,0)),\n0)","v":0}]
[null,null,null,null,"Administrative and support service activitiesTravel agency, tour operator reservation service and related activitiesOther reservation service and related activities","79.9","Administrative and support service activities","Travel agency, tour operator reservation service and related activities","Other reservation service and related activities","Low","Low","Low","[n/a]","[n/a]",null,{"$f":"IF($G308=Section,\nIF(COUNTIFS(P$22:P307,$H308)=0,$H308,0),\n0)","v":0},{"$f":"IF(AND($G308=Section,$H308=Category),\nIF(COUNTIFS(Q$22:Q307,$I308)=0,$I308,0),\n0)","v":0},null,null,{"$f":"IFERROR(\nINDEX(OFFSET(P307,MATCH(\"\"&T307,P307:P$339,0),0):P$339,MATCH(\"*\",OFFSET(P307,MATCH(\"\"&T307,P307:P$339,0),0):P$339,0)),\n0)","v":0},{"$f":"IFERROR(\nINDEX(OFFSET(Q307,MATCH(\"\"&U307,Q307:Q$339,0),0):Q$339,MATCH(\"*\",OFFSET(Q307,MATCH(\"\"&U307,Q307:Q$339,0),0):Q$339,0)),\n0)","v":0}]
[null,null,null,null,"Administrative and support service activitiesSecurity and investigation activitiesPrivate security activities","80.1","Administrative and support service activities","Security and investigation activities","Private security activities","Low","High","High","t5","Not yet drafted",null,{"$f":"IF($G309=Section,\nIF(COUNTIFS(P$22:P308,$H309)=0,$H309,0),\n0)","v":0},{"$f":"IF(AND($G309=Section,$H309=Category),\nIF(COUNTIFS(Q$22:Q308,$I309)=0,$I309,0),\n0)","v":0},null,null,{"$f":"IFERROR(\nINDEX(OFFSET(P308,MATCH(\"\"&T308,P308:P$339,0),0):P$339,MATCH(\"*\",OFFSET(P308,MATCH(\"\"&T308,P308:P$339,0),0):P$339,0)),\n0)","v":0},{"$f":"IFERROR(\nINDEX(OFFSET(Q308,MATCH(\"\"&U308,Q308:Q$339,0),0):Q$339,MATCH(\"*\",OFFSET(Q308,MATCH(\"\"&U308,Q308:Q$339,0),0):Q$339,0)),\n0)","v":0}]
[null,null,null,null,"Administrative and support service activitiesSecurity and investigation activitiesSecurity systems service activities","80.2","Administrative and support service activities","Security and investigation activities","Security systems service activities","Low","Low","Low","[n/a]","[n/a]",null,{"$f":"IF($G310=Section,\nIF(COUNTIFS(P$22:P309,$H310)=0,$H310,0),\n0)","v":0},{"$f":"IF(AND($G310=Section,$H310=Category),\nIF(COUNTIFS(Q$22:Q309,$I310)=0,$I310,0),\n0)","v":0},null,null,{"$f":"IFERROR(\nINDEX(OFFSET(P309,MATCH(\"\"&T309,P309:P$339,0),0):P$339,MATCH(\"*\",OFFSET(P309,MATCH(\"\"&T309,P309:P$339,0),0):P$339,0)),\n0)","v":0},{"$f":"IFERROR(\nINDEX(OFFSET(Q309,MATCH(\"\"&U309,Q309:Q$339,0),0):Q$339,MATCH(\"*\",OFFSET(Q309,MATCH(\"\"&U309,Q309:Q$339,0),0):Q$339,0)),\n0)","v":0}]
[null,null,null,null,"Administrative and support service activitiesSecurity and investigation activitiesInvestigation activities","80.3","Administrative and support service activities","Security and investigation activities","Investigation activities","Low","Medium","Medium","t6","Not yet drafted",null,{"$f":"IF($G311=Section,\nIF(COUNTIFS(P$22:P310,$H311)=0,$H311,0),\n0)","v":0},{"$f":"IF(AND($G311=Section,$H311=Category),\nIF(COUNTIFS(Q$22:Q310,$I311)=0,$I311,0),\n0)","v":0},null,null,{"$f":"IFERROR(\nINDEX(OFFSET(P310,MATCH(\"\"&T310,P310:P$339,0),0):P$339,MATCH(\"*\",OFFSET(P310,MATCH(\"\"&T310,P310:P$339,0),0):P$339,0)),\n0)","v":0},{"$f":"IFERROR(\nINDEX(OFFSET(Q310,MATCH(\"\"&U310,Q310:Q$339,0),0):Q$339,MATCH(\"*\",OFFSET(Q310,MATCH(\"\"&U310,Q310:Q$339,0),0):Q$339,0)),\n0)","v":0}]
[null,null,null,null,"Administrative and support service activitiesServices to buildings and landscape activitiesCombined facilities support activities","81.1","Administrative and support service activities","Services to buildings and landscape activities","Combined facilities support activities","Low","Medium","Medium","t10","Not yet drafted",null,{"$f":"IF($G312=Section,\nIF(COUNTIFS(P$22:P311,$H312)=0,$H312,0),\n0)","v":0},{"$f":"IF(AND($G312=Section,$H312=Category),\nIF(COUNTIFS(Q$22:Q311,$I312)=0,$I312,0),\n0)","v":0},null,null,{"$f":"IFERROR(\nINDEX(OFFSET(P311,MATCH(\"\"&T311,P311:P$339,0),0):P$339,MATCH(\"*\",OFFSET(P311,MATCH(\"\"&T311,P311:P$339,0),0):P$339,0)),\n0)","v":0},{"$f":"IFERROR(\nINDEX(OFFSET(Q311,MATCH(\"\"&U311,Q311:Q$339,0),0):Q$339,MATCH(\"*\",OFFSET(Q311,MATCH(\"\"&U311,Q311:Q$339,0),0):Q$339,0)),\n0)","v":0}]
[null,null,null,null,"Administrative and support service activitiesServices to buildings and landscape activitiesGeneral Cleaning of buildings","81.21","Administrative and support service activities","Services to buildings and landscape activities","General Cleaning of buildings","Low","Medium","Medium","t55","Not yet drafted",null,{"$f":"IF($G313=Section,\nIF(COUNTIFS(P$22:P312,$H313)=0,$H313,0),\n0)","v":0},{"$f":"IF(AND($G313=Section,$H313=Category),\nIF(COUNTIFS(Q$22:Q312,$I313)=0,$I313,0),\n0)","v":0},null,null,{"$f":"IFERROR(\nINDEX(OFFSET(P312,MATCH(\"\"&T312,P312:P$339,0),0):P$339,MATCH(\"*\",OFFSET(P312,MATCH(\"\"&T312,P312:P$339,0),0):P$339,0)),\n0)","v":0},{"$f":"IFERROR(\nINDEX(OFFSET(Q312,MATCH(\"\"&U312,Q312:Q$339,0),0):Q$339,MATCH(\"*\",OFFSET(Q312,MATCH(\"\"&U312,Q312:Q$339,0),0):Q$339,0)),\n0)","v":0}]
[null,null,null,null,"Administrative and support service activitiesServices to buildings and landscape activitiesOther buildings and industrial cleaning activities","81.22","Administrative and support service activities","Services to buildings and landscape activities","Other buildings and industrial cleaning activities","Low","Medium","Medium","t55","Not yet drafted",null,{"$f":"IF($G314=Section,\nIF(COUNTIFS(P$22:P313,$H314)=0,$H314,0),\n0)","v":0},{"$f":"IF(AND($G314=Section,$H314=Category),\nIF(COUNTIFS(Q$22:Q313,$I314)=0,$I314,0),\n0)","v":0},null,null,{"$f":"IFERROR(\nINDEX(OFFSET(P313,MATCH(\"\"&T313,P313:P$339,0),0):P$339,MATCH(\"*\",OFFSET(P313,MATCH(\"\"&T313,P313:P$339,0),0):P$339,0)),\n0)","v":0},{"$f":"IFERROR(\nINDEX(OFFSET(Q313,MATCH(\"\"&U313,Q313:Q$339,0),0):Q$339,MATCH(\"*\",OFFSET(Q313,MATCH(\"\"&U313,Q313:Q$339,0),0):Q$339,0)),\n0)","v":0}]
[null,null,null,null,"Administrative and support service activitiesServices to buildings and landscape activitiesOther cleaning activities","81.29","Administrative and support service activities","Services to buildings and landscape activities","Other cleaning activities","Low","Medium","Medium","t55","Not yet drafted",null,{"$f":"IF($G315=Section,\nIF(COUNTIFS(P$22:P314,$H315)=0,$H315,0),\n0)","v":0},{"$f":"IF(AND($G315=Section,$H315=Category),\nIF(COUNTIFS(Q$22:Q314,$I315)=0,$I315,0),\n0)","v":0},null,null,{"$f":"IFERROR(\nINDEX(OFFSET(P314,MATCH(\"\"&T314,P314:P$339,0),0):P$339,MATCH(\"*\",OFFSET(P314,MATCH(\"\"&T314,P314:P$339,0),0):P$339,0)),\n0)","v":0},{"$f":"IFERROR(\nINDEX(OFFSET(Q314,MATCH(\"\"&U314,Q314:Q$339,0),0):Q$339,MATCH(\"*\",OFFSET(Q314,MATCH(\"\"&U314,Q314:Q$339,0),0):Q$339,0)),\n0)","v":0}]
[null,null,null,null,"Administrative and support service activitiesServices to buildings and landscape activitiesLandscape service activities","81.3","Administrative and support service activities","Services to buildings and landscape activities","Landscape service activities","Low","Medium","Medium","t115","Not yet drafted",null,{"$f":"IF($G316=Section,\nIF(COUNTIFS(P$22:P315,$H316)=0,$H316,0),\n0)","v":0},{"$f":"IF(AND($G316=Section,$H316=Category),\nIF(COUNTIFS(Q$22:Q315,$I316)=0,$I316,0),\n0)","v":0},null,null,{"$f":"IFERROR(\nINDEX(OFFSET(P315,MATCH(\"\"&T315,P315:P$339,0),0):P$339,MATCH(\"*\",OFFSET(P315,MATCH(\"\"&T315,P315:P$339,0),0):P$339,0)),\n0)","v":0},{"$f":"IFERROR(\nINDEX(OFFSET(Q315,MATCH(\"\"&U315,Q315:Q$339,0),0):Q$339,MATCH(\"*\",OFFSET(Q315,MATCH(\"\"&U315,Q315:Q$339,0),0):Q$339,0)),\n0)","v":0}]
[null,null,null,null,"Administrative and support service activitiesOffice administrative, office support and other business support activitiesCombined office administrative service activities","82.11","Administrative and support service activities","Office administrative, office support and other business support activities","Combined office administrative service activities","Low","Low","Low","[n/a]","[n/a]",null,{"$f":"IF($G317=Section,\nIF(COUNTIFS(P$22:P316,$H317)=0,$H317,0),\n0)","v":0},{"$f":"IF(AND($G317=Section,$H317=Category),\nIF(COUNTIFS(Q$22:Q316,$I317)=0,$I317,0),\n0)","v":0},null,null,{"$f":"IFERROR(\nINDEX(OFFSET(P316,MATCH(\"\"&T316,P316:P$339,0),0):P$339,MATCH(\"*\",OFFSET(P316,MATCH(\"\"&T316,P316:P$339,0),0):P$339,0)),\n0)","v":0},{"$f":"IFERROR(\nINDEX(OFFSET(Q316,MATCH(\"\"&U316,Q316:Q$339,0),0):Q$339,MATCH(\"*\",OFFSET(Q316,MATCH(\"\"&U316,Q316:Q$339,0),0):Q$339,0)),\n0)","v":0}]
[null,null,null,null,"Administrative and support service activitiesOffice administrative, office support and other business support activitiesOther specialised office support activities (e.g. photocopying etc.)","82.19","Administrative and support service activities","Office administrative, office support and other business support activities","Other specialised office support activities (e.g. photocopying etc.)","Low","Low","Low","[n/a]","[n/a]",null,{"$f":"IF($G318=Section,\nIF(COUNTIFS(P$22:P317,$H318)=0,$H318,0),\n0)","v":0},{"$f":"IF(AND($G318=Section,$H318=Category),\nIF(COUNTIFS(Q$22:Q317,$I318)=0,$I318,0),\n0)","v":0},null,null,{"$f":"IFERROR(\nINDEX(OFFSET(P317,MATCH(\"\"&T317,P317:P$339,0),0):P$339,MATCH(\"*\",OFFSET(P317,MATCH(\"\"&T317,P317:P$339,0),0):P$339,0)),\n0)","v":0},{"$f":"IFERROR(\nINDEX(OFFSET(Q317,MATCH(\"\"&U317,Q317:Q$339,0),0):Q$339,MATCH(\"*\",OFFSET(Q317,MATCH(\"\"&U317,Q317:Q$339,0),0):Q$339,0)),\n0)","v":0}]
[null,null,null,null,"Administrative and support service activitiesOffice administrative, office support and other business support activitiesActivities of call centres","82.2","Administrative and support service activities","Office administrative, office support and other business support activities","Activities of call centres","Low","Low","Low","[n/a]","[n/a]",null,{"$f":"IF($G319=Section,\nIF(COUNTIFS(P$22:P318,$H319)=0,$H319,0),\n0)","v":0},{"$f":"IF(AND($G319=Section,$H319=Category),\nIF(COUNTIFS(Q$22:Q318,$I319)=0,$I319,0),\n0)","v":0},null,null,{"$f":"IFERROR(\nINDEX(OFFSET(P318,MATCH(\"\"&T318,P318:P$339,0),0):P$339,MATCH(\"*\",OFFSET(P318,MATCH(\"\"&T318,P318:P$339,0),0):P$339,0)),\n0)","v":0},{"$f":"IFERROR(\nINDEX(OFFSET(Q318,MATCH(\"\"&U318,Q318:Q$339,0),0):Q$339,MATCH(\"*\",OFFSET(Q318,MATCH(\"\"&U318,Q318:Q$339,0),0):Q$339,0)),\n0)","v":0}]
[null,null,null,null,"Administrative and support service activitiesOffice administrative, office support and other business support activitiesOrganisation of conventions and trade shows","82.3","Administrative and support service activities","Office administrative, office support and other business support activities","Organisation of conventions and trade shows","Low","Low","Low","[n/a]","[n/a]",null,{"$f":"IF($G320=Section,\nIF(COUNTIFS(P$22:P319,$H320)=0,$H320,0),\n0)","v":0},{"$f":"IF(AND($G320=Section,$H320=Category),\nIF(COUNTIFS(Q$22:Q319,$I320)=0,$I320,0),\n0)","v":0},null,null,{"$f":"IFERROR(\nINDEX(OFFSET(P319,MATCH(\"\"&T319,P319:P$339,0),0):P$339,MATCH(\"*\",OFFSET(P319,MATCH(\"\"&T319,P319:P$339,0),0):P$339,0)),\n0)","v":0},{"$f":"IFERROR(\nINDEX(OFFSET(Q319,MATCH(\"\"&U319,Q319:Q$339,0),0):Q$339,MATCH(\"*\",OFFSET(Q319,MATCH(\"\"&U319,Q319:Q$339,0),0):Q$339,0)),\n0)","v":0}]
[null,null,null,null,"Administrative and support service activitiesOffice administrative, office support and other business support activitiesActivities of collection agencies and credit bureaus","82.91","Administrative and support service activities","Office administrative, office support and other business support activities","Activities of collection agencies and credit bureaus","Low","High","Medium","t7","Not yet drafted",null,{"$f":"IF($G321=Section,\nIF(COUNTIFS(P$22:P320,$H321)=0,$H321,0),\n0)","v":0},{"$f":"IF(AND($G321=Section,$H321=Category),\nIF(COUNTIFS(Q$22:Q320,$I321)=0,$I321,0),\n0)","v":0},null,null,{"$f":"IFERROR(\nINDEX(OFFSET(P320,MATCH(\"\"&T320,P320:P$339,0),0):P$339,MATCH(\"*\",OFFSET(P320,MATCH(\"\"&T320,P320:P$339,0),0):P$339,0)),\n0)","v":0},{"$f":"IFERROR(\nINDEX(OFFSET(Q320,MATCH(\"\"&U320,Q320:Q$339,0),0):Q$339,MATCH(\"*\",OFFSET(Q320,MATCH(\"\"&U320,Q320:Q$339,0),0):Q$339,0)),\n0)","v":0}]
[null,null,null,null,"Administrative and support service activitiesOffice administrative, office support and other business support activitiesPackaging activities","82.92","Administrative and support service activities","Office administrative, office support and other business support activities","Packaging activities","Low","Medium","Medium","t63","Not yet drafted",null,{"$f":"IF($G322=Section,\nIF(COUNTIFS(P$22:P321,$H322)=0,$H322,0),\n0)","v":0},{"$f":"IF(AND($G322=Section,$H322=Category),\nIF(COUNTIFS(Q$22:Q321,$I322)=0,$I322,0),\n0)","v":0},null,null,{"$f":"IFERROR(\nINDEX(OFFSET(P321,MATCH(\"\"&T321,P321:P$339,0),0):P$339,MATCH(\"*\",OFFSET(P321,MATCH(\"\"&T321,P321:P$339,0),0):P$339,0)),\n0)","v":0},{"$f":"IFERROR(\nINDEX(OFFSET(Q321,MATCH(\"\"&U321,Q321:Q$339,0),0):Q$339,MATCH(\"*\",OFFSET(Q321,MATCH(\"\"&U321,Q321:Q$339,0),0):Q$339,0)),\n0)","v":0}]
[null,null,null,null,"Administrative and support service activitiesOffice administrative, office support and other business support activitiesOther business support service activities not elsewhere classified","82.99","Administrative and support service activities","Office administrative, office support and other business support activities","Other business support service activities not elsewhere classified","Low","Low","Low","[n/a]","[n/a]",null,{"$f":"IF($G323=Section,\nIF(COUNTIFS(P$22:P322,$H323)=0,$H323,0),\n0)","v":0},{"$f":"IF(AND($G323=Section,$H323=Category),\nIF(COUNTIFS(Q$22:Q322,$I323)=0,$I323,0),\n0)","v":0},null,null,{"$f":"IFERROR(\nINDEX(OFFSET(P322,MATCH(\"\"&T322,P322:P$339,0),0):P$339,MATCH(\"*\",OFFSET(P322,MATCH(\"\"&T322,P322:P$339,0),0):P$339,0)),\n0)","v":0},{"$f":"IFERROR(\nINDEX(OFFSET(Q322,MATCH(\"\"&U322,Q322:Q$339,0),0):Q$339,MATCH(\"*\",OFFSET(Q322,MATCH(\"\"&U322,Q322:Q$339,0),0):Q$339,0)),\n0)","v":0}]
[null,null,null,null,"Public administration and defence compulsory social securityPublic administration and defence; compulsory and social security[n/a]","84","Public administration and defence compulsory social security","Public administration and defence; compulsory and social security","[n/a]","Low","Low","Low","[n/a]","[n/a]",null,{"$f":"IF($G324=Section,\nIF(COUNTIFS(P$22:P323,$H324)=0,$H324,0),\n0)","v":0},{"$f":"IF(AND($G324=Section,$H324=Category),\nIF(COUNTIFS(Q$22:Q323,$I324)=0,$I324,0),\n0)","v":0},null,null,{"$f":"IFERROR(\nINDEX(OFFSET(P323,MATCH(\"\"&T323,P323:P$339,0),0):P$339,MATCH(\"*\",OFFSET(P323,MATCH(\"\"&T323,P323:P$339,0),0):P$339,0)),\n0)","v":0},{"$f":"IFERROR(\nINDEX(OFFSET(Q323,MATCH(\"\"&U323,Q323:Q$339,0),0):Q$339,MATCH(\"*\",OFFSET(Q323,MATCH(\"\"&U323,Q323:Q$339,0),0):Q$339,0)),\n0)","v":0}]
[null,null,null,null,"EducationEducation[n/a]","85","Education","Education","[n/a]","Low","Low","Low","[n/a]","[n/a]",null,{"$f":"IF($G325=Section,\nIF(COUNTIFS(P$22:P324,$H325)=0,$H325,0),\n0)","v":0},{"$f":"IF(AND($G325=Section,$H325=Category),\nIF(COUNTIFS(Q$22:Q324,$I325)=0,$I325,0),\n0)","v":0},null,null,{"$f":"IFERROR(\nINDEX(OFFSET(P324,MATCH(\"\"&T324,P324:P$339,0),0):P$339,MATCH(\"*\",OFFSET(P324,MATCH(\"\"&T324,P324:P$339,0),0):P$339,0)),\n0)","v":0},{"$f":"IFERROR(\nINDEX(OFFSET(Q324,MATCH(\"\"&U324,Q324:Q$339,0),0):Q$339,MATCH(\"*\",OFFSET(Q324,MATCH(\"\"&U324,Q324:Q$339,0),0):Q$339,0)),\n0)","v":0}]
[null,null,null,null,"Human health and social work activitiesHuman health activities[n/a]","86","Human health and social work activities","Human health activities","[n/a]","Medium","Medium","Medium","t14","Not yet drafted",null,{"$f":"IF($G326=Section,\nIF(COUNTIFS(P$22:P325,$H326)=0,$H326,0),\n0)","v":0},{"$f":"IF(AND($G326=Section,$H326=Category),\nIF(COUNTIFS(Q$22:Q325,$I326)=0,$I326,0),\n0)","v":0},null,null,{"$f":"IFERROR(\nINDEX(OFFSET(P325,MATCH(\"\"&T325,P325:P$339,0),0):P$339,MATCH(\"*\",OFFSET(P325,MATCH(\"\"&T325,P325:P$339,0),0):P$339,0)),\n0)","v":0},{"$f":"IFERROR(\nINDEX(OFFSET(Q325,MATCH(\"\"&U325,Q325:Q$339,0),0):Q$339,MATCH(\"*\",OFFSET(Q325,MATCH(\"\"&U325,Q325:Q$339,0),0):Q$339,0)),\n0)","v":0}]
[null,null,null,null,"Human health and social work activitiesResidential care activities[n/a]","87","Human health and social work activities","Residential care activities","[n/a]","Low","Medium","Medium","t15","Not yet drafted",null,{"$f":"IF($G327=Section,\nIF(COUNTIFS(P$22:P326,$H327)=0,$H327,0),\n0)","v":0},{"$f":"IF(AND($G327=Section,$H327=Category),\nIF(COUNTIFS(Q$22:Q326,$I327)=0,$I327,0),\n0)","v":0},null,null,{"$f":"IFERROR(\nINDEX(OFFSET(P326,MATCH(\"\"&T326,P326:P$339,0),0):P$339,MATCH(\"*\",OFFSET(P326,MATCH(\"\"&T326,P326:P$339,0),0):P$339,0)),\n0)","v":0},{"$f":"IFERROR(\nINDEX(OFFSET(Q326,MATCH(\"\"&U326,Q326:Q$339,0),0):Q$339,MATCH(\"*\",OFFSET(Q326,MATCH(\"\"&U326,Q326:Q$339,0),0):Q$339,0)),\n0)","v":0}]
[null,null,null,null,"Human health and social work activitiesSocial work activities without accommodation[n/a]","88","Human health and social work activities","Social work activities without accommodation","[n/a]","Low","Medium","Medium","t9","Not yet drafted",null,{"$f":"IF($G328=Section,\nIF(COUNTIFS(P$22:P327,$H328)=0,$H328,0),\n0)","v":0},{"$f":"IF(AND($G328=Section,$H328=Category),\nIF(COUNTIFS(Q$22:Q327,$I328)=0,$I328,0),\n0)","v":0},null,null,{"$f":"IFERROR(\nINDEX(OFFSET(P327,MATCH(\"\"&T327,P327:P$339,0),0):P$339,MATCH(\"*\",OFFSET(P327,MATCH(\"\"&T327,P327:P$339,0),0):P$339,0)),\n0)","v":0},{"$f":"IFERROR(\nINDEX(OFFSET(Q327,MATCH(\"\"&U327,Q327:Q$339,0),0):Q$339,MATCH(\"*\",OFFSET(Q327,MATCH(\"\"&U327,Q327:Q$339,0),0):Q$339,0)),\n0)","v":0}]
[null,null,null,null,"Arts, entertainment and recreationCreative, arts and entertainment activities[n/a]","90","Arts, entertainment and recreation","Creative, arts and entertainment activities","[n/a]","Low","Low","Low","[n/a]","[n/a]",null,{"$f":"IF($G329=Section,\nIF(COUNTIFS(P$22:P328,$H329)=0,$H329,0),\n0)","v":0},{"$f":"IF(AND($G329=Section,$H329=Category),\nIF(COUNTIFS(Q$22:Q328,$I329)=0,$I329,0),\n0)","v":0},null,null,{"$f":"IFERROR(\nINDEX(OFFSET(P328,MATCH(\"\"&T328,P328:P$339,0),0):P$339,MATCH(\"*\",OFFSET(P328,MATCH(\"\"&T328,P328:P$339,0),0):P$339,0)),\n0)","v":0},{"$f":"IFERROR(\nINDEX(OFFSET(Q328,MATCH(\"\"&U328,Q328:Q$339,0),0):Q$339,MATCH(\"*\",OFFSET(Q328,MATCH(\"\"&U328,Q328:Q$339,0),0):Q$339,0)),\n0)","v":0}]
[null,null,null,null,"Arts, entertainment and recreationLibraries, archives, museums and other cultural activities[n/a]","91","Arts, entertainment and recreation","Libraries, archives, museums and other cultural activities","[n/a]","Low","Low","Low","[n/a]","[n/a]",null,{"$f":"IF($G330=Section,\nIF(COUNTIFS(P$22:P329,$H330)=0,$H330,0),\n0)","v":0},{"$f":"IF(AND($G330=Section,$H330=Category),\nIF(COUNTIFS(Q$22:Q329,$I330)=0,$I330,0),\n0)","v":0},null,null,{"$f":"IFERROR(\nINDEX(OFFSET(P329,MATCH(\"\"&T329,P329:P$339,0),0):P$339,MATCH(\"*\",OFFSET(P329,MATCH(\"\"&T329,P329:P$339,0),0):P$339,0)),\n0)","v":0},{"$f":"IFERROR(\nINDEX(OFFSET(Q329,MATCH(\"\"&U329,Q329:Q$339,0),0):Q$339,MATCH(\"*\",OFFSET(Q329,MATCH(\"\"&U329,Q329:Q$339,0),0):Q$339,0)),\n0)","v":0}]
[null,null,null,null,"Arts, entertainment and recreationGambling and betting activities[n/a]","92","Arts, entertainment and recreation","Gambling and betting activities","[n/a]","Excluded","Excluded","Excluded","[n/a]","[n/a]",null,{"$f":"IF($G331=Section,\nIF(COUNTIFS(P$22:P330,$H331)=0,$H331,0),\n0)","v":0},{"$f":"IF(AND($G331=Section,$H331=Category),\nIF(COUNTIFS(Q$22:Q330,$I331)=0,$I331,0),\n0)","v":0},null,null,{"$f":"IFERROR(\nINDEX(OFFSET(P330,MATCH(\"\"&T330,P330:P$339,0),0):P$339,MATCH(\"*\",OFFSET(P330,MATCH(\"\"&T330,P330:P$339,0),0):P$339,0)),\n0)","v":0},{"$f":"IFERROR(\nINDEX(OFFSET(Q330,MATCH(\"\"&U330,Q330:Q$339,0),0):Q$339,MATCH(\"*\",OFFSET(Q330,MATCH(\"\"&U330,Q330:Q$339,0),0):Q$339,0)),\n0)","v":0}]
[null,null,null,null,"Other service activitiesActivities of membership organisations[n/a]","94","Other service activities","Activities of membership organisations","[n/a]","Low","Low","Low","[n/a]","[n/a]",null,{"$f":"IF($G332=Section,\nIF(COUNTIFS(P$22:P331,$H332)=0,$H332,0),\n0)","v":0},{"$f":"IF(AND($G332=Section,$H332=Category),\nIF(COUNTIFS(Q$22:Q331,$I332)=0,$I332,0),\n0)","v":0},null,null,{"$f":"IFERROR(\nINDEX(OFFSET(P331,MATCH(\"\"&T331,P331:P$339,0),0):P$339,MATCH(\"*\",OFFSET(P331,MATCH(\"\"&T331,P331:P$339,0),0):P$339,0)),\n0)","v":0},{"$f":"IFERROR(\nINDEX(OFFSET(Q331,MATCH(\"\"&U331,Q331:Q$339,0),0):Q$339,MATCH(\"*\",OFFSET(Q331,MATCH(\"\"&U331,Q331:Q$339,0),0):Q$339,0)),\n0)","v":0}]
[null,null,null,null,"Other service activitiesRepair of computers and personal and household goods[n/a]","95","Other service activities","Repair of computers and personal and household goods","[n/a]","Low","Low","Low","[n/a]","[n/a]",null,{"$f":"IF($G333=Section,\nIF(COUNTIFS(P$22:P332,$H333)=0,$H333,0),\n0)","v":0},{"$f":"IF(AND($G333=Section,$H333=Category),\nIF(COUNTIFS(Q$22:Q332,$I333)=0,$I333,0),\n0)","v":0},null,null,{"$f":"IFERROR(\nINDEX(OFFSET(P332,MATCH(\"\"&T332,P332:P$339,0),0):P$339,MATCH(\"*\",OFFSET(P332,MATCH(\"\"&T332,P332:P$339,0),0):P$339,0)),\n0)","v":0},{"$f":"IFERROR(\nINDEX(OFFSET(Q332,MATCH(\"\"&U332,Q332:Q$339,0),0):Q$339,MATCH(\"*\",OFFSET(Q332,MATCH(\"\"&U332,Q332:Q$339,0),0):Q$339,0)),\n0)","v":0}]
[null,null,null,null,"Other service activitiesOther personal service activitiesOther personal service activities n.e.c. (i.e. excluding washing and dry-cleaning of textile and fur products)","96","Other service activities","Other personal service activities","Other personal service activities n.e.c. (i.e. excluding washing and dry-cleaning of textile and fur products)","Low","Low","Low","[n/a]","[n/a]",null,{"$f":"IF($G334=Section,\nIF(COUNTIFS(P$22:P333,$H334)=0,$H334,0),\n0)","v":0},{"$f":"IF(AND($G334=Section,$H334=Category),\nIF(COUNTIFS(Q$22:Q333,$I334)=0,$I334,0),\n0)","v":0},null,null,{"$f":"IFERROR(\nINDEX(OFFSET(P333,MATCH(\"\"&T333,P333:P$339,0),0):P$339,MATCH(\"*\",OFFSET(P333,MATCH(\"\"&T333,P333:P$339,0),0):P$339,0)),\n0)","v":0},{"$f":"IFERROR(\nINDEX(OFFSET(Q333,MATCH(\"\"&U333,Q333:Q$339,0),0):Q$339,MATCH(\"*\",OFFSET(Q333,MATCH(\"\"&U333,Q333:Q$339,0),0):Q$339,0)),\n0)","v":0}]
[null,null,null,null,"Other service activitiesOther personal service activitiesWashing and (dry-)cleaning of textile and fur products","96.01","Other service activities","Other personal service activities","Washing and (dry-)cleaning of textile and fur products","Medium","Medium","Medium","t60","Not yet drafted",null,{"$f":"IF($G335=Section,\nIF(COUNTIFS(P$22:P334,$H335)=0,$H335,0),\n0)","v":0},{"$f":"IF(AND($G335=Section,$H335=Category),\nIF(COUNTIFS(Q$22:Q334,$I335)=0,$I335,0),\n0)","v":0},null,null,{"$f":"IFERROR(\nINDEX(OFFSET(P334,MATCH(\"\"&T334,P334:P$339,0),0):P$339,MATCH(\"*\",OFFSET(P334,MATCH(\"\"&T334,P334:P$339,0),0):P$339,0)),\n0)","v":0},{"$f":"IFERROR(\nINDEX(OFFSET(Q334,MATCH(\"\"&U334,Q334:Q$339,0),0):Q$339,MATCH(\"*\",OFFSET(Q334,MATCH(\"\"&U334,Q334:Q$339,0),0):Q$339,0)),\n0)","v":0}]
[null,null,null,null,"Activities of households as employers; undifferentiated goods and services producing activities of households for own useActivities of households as employers of domestic personnel[n/a]","97","Activities of households as employers; undifferentiated goods and services producing activities of households for own use","Activities of households as employers of domestic personnel","[n/a]","Low","Medium","Medium","t8","Not yet drafted",null,{"$f":"IF($G336=Section,\nIF(COUNTIFS(P$22:P335,$H336)=0,$H336,0),\n0)","v":0},{"$f":"IF(AND($G336=Section,$H336=Category),\nIF(COUNTIFS(Q$22:Q335,$I336)=0,$I336,0),\n0)","v":0},null,null,{"$f":"IFERROR(\nINDEX(OFFSET(P335,MATCH(\"\"&T335,P335:P$339,0),0):P$339,MATCH(\"*\",OFFSET(P335,MATCH(\"\"&T335,P335:P$339,0),0):P$339,0)),\n0)","v":0},{"$f":"IFERROR(\nINDEX(OFFSET(Q335,MATCH(\"\"&U335,Q335:Q$339,0),0):Q$339,MATCH(\"*\",OFFSET(Q335,MATCH(\"\"&U335,Q335:Q$339,0),0):Q$339,0)),\n0)","v":0}]
[null,null,null,null,"Activities of households as employers; undifferentiated goods and services producing activities of households for own useUndifferentiated goods and services producing activities for own use[n/a]","98","Activities of households as employers; undifferentiated goods and services producing activities of households for own use","Undifferentiated goods and services producing activities for own use","[n/a]","Low","Low","Low","[n/a]","[n/a]",null,{"$f":"IF($G337=Section,\nIF(COUNTIFS(P$22:P336,$H337)=0,$H337,0),\n0)","v":0},{"$f":"IF(AND($G337=Section,$H337=Category),\nIF(COUNTIFS(Q$22:Q336,$I337)=0,$I337,0),\n0)","v":0},null,null,{"$f":"IFERROR(\nINDEX(OFFSET(P336,MATCH(\"\"&T336,P336:P$339,0),0):P$339,MATCH(\"*\",OFFSET(P336,MATCH(\"\"&T336,P336:P$339,0),0):P$339,0)),\n0)","v":0},{"$f":"IFERROR(\nINDEX(OFFSET(Q336,MATCH(\"\"&U336,Q336:Q$339,0),0):Q$339,MATCH(\"*\",OFFSET(Q336,MATCH(\"\"&U336,Q336:Q$339,0),0):Q$339,0)),\n0)","v":0}]
[null,null,null,null,"Activities of extraterritorial organisations and bodies, e.g. diplomatic and consular missions, international organisations, etc.Activities of extraterritorial organisations and bodies[n/a]","99","Activities of extraterritorial organisations and bodies, e.g. diplomatic and consular missions, international organisations, etc.","Activities of extraterritorial organisations and bodies","[n/a]","Low","Low","Low","[n/a]","[n/a]",null,{"$f":"IF($G338=Section,\nIF(COUNTIFS(P$22:P337,$H338)=0,$H338,0),\n0)","v":0},{"$f":"IF(AND($G338=Section,$H338=Category),\nIF(COUNTIFS(Q$22:Q337,$I338)=0,$I338,0),\n0)","v":0},null,null,{"$f":"IFERROR(\nINDEX(OFFSET(P337,MATCH(\"\"&T337,P337:P$339,0),0):P$339,MATCH(\"*\",OFFSET(P337,MATCH(\"\"&T337,P337:P$339,0),0):P$339,0)),\n0)","v":0},{"$f":"IFERROR(\nINDEX(OFFSET(Q337,MATCH(\"\"&U337,Q337:Q$339,0),0):Q$339,MATCH(\"*\",OFFSET(Q337,MATCH(\"\"&U337,Q337:Q$339,0),0):Q$339,0)),\n0)","v":0}]

{"sheet":"2b","index":11,"n_rows":1420,"n_cols":11,"rows_kept":1420,"cut":false,"hidden":true,"merged":[]}
[null,"2b. E&S IssueTables"]
[]
[]
[null,null,"ESIssueTableID","t#","Title","i#","E&S Issue Category","Environment","Health & Safety","Labour","Community"]
[null,null,{"$f":"D5&F5","v":"t1i1"},"t1","[Activities of employment placement agencies]","i1","Labour Rights","","","ü","ü"]
[null,null,{"$f":"D6&F6","v":"t1i2"},"t1","[Activities of employment placement agencies]","i2","Occupational Health and Safety ","","ü","ü"]
[null,null,"t1i3","t1","[Activities of employment placement agencies]","i3","Community and Social Risks",null,"","","ü"]
[null,null,"t1i4","t1","[Activities of employment placement agencies]","i4","Energy Consumption","ü","","",""]
[null,null,"t1i5","t1","[Activities of employment placement agencies]","i5","Solid Waste","ü","","",""]
[null,null,"t2i1","t2","[Temporary employment agencies]","i1","Labour Rights","","","ü","ü"]
[null,null,"t2i2","t2","[Temporary employment agencies]","i2","Occupational Health and Safety ","","ü","ü"]
[null,null,"t2i3","t2","[Temporary employment agencies]","i3","Community and Social Risks",null,"","","ü"]
[null,null,"t2i4","t2","[Temporary employment agencies]","i4","Energy Consumption","ü","","",""]
[null,null,"t2i5","t2","[Temporary employment agencies]","i5","Solid Waste","ü","","",""]
[null,null,"t3i1","t3","[Other human resources provision]","i1","Labour Rights","","","ü","ü"]
[null,null,"t3i2","t3","[Other human resources provision]","i2","Occupational Health and Safety ","","ü","ü"]
[null,null,"t3i3","t3","[Other human resources provision]","i3","Community and Social Risks",null,"","","ü"]
[null,null,"t3i4","t3","[Other human resources provision]","i4","Energy Consumption","ü","","",""]
[null,null,"t3i5","t3","[Other human resources provision]","i5","Solid Waste","ü","","",""]
[null,null,"t4i1","t4","[Travel agency and tour operator activities]","i1","Labour Rights","","","ü","ü"]
[null,null,"t4i2","t4","[Travel agency and tour operator activities]","i2","Occupational Health and Safety ","","ü","ü"]
[null,null,"t4i3","t4","[Travel agency and tour operator activities]","i3","Community and Social Risks",null,"","","ü"]
[null,null,"t4i4","t4","[Travel agency and tour operator activities]","i4","Energy Consumption","ü","","",""]
[null,null,"t4i5","t4","[Travel agency and tour operator activities]","i5","Solid Waste","ü","","",""]
[null,null,"t4i6","t4","[Travel agency and tour operator activities]","i6","Bioethics","ü",null,""]
[null,null,"t4i7","t4","[Travel agency and tour operator activities]","i7","Distribution and Transport","ü",null,null,""]
[null,null,"t4i8","t4","[Travel agency and tour operator activities]","i8","Threats to/from biodiversity","ü","","",""]
[null,null,"t4i9","t4","[Travel agency and tour operator activities]","i9","Violence and security issues","","","ü",""]
[null,null,"t5i1","t5","[Private security activities]","i1","Violence and security issues","","ü","ü","ü"]
[null,null,"t5i2","t5","[Private security activities]","i2","Labour Rights",null,"ü","ü","ü"]
[null,null,"t5i3","t5","[Private security activities]","i3","Occupational Health and Safety ","","ü","ü","ü"]
[null,null,"t5i4","t5","[Private security activities]","i4","Community and Social Risks",null,"","","ü"]
[null,null,"t5i5","t5","[Private security activities]","i5","Energy Consumption","ü",null,null,""]
[null,null,"t5i6","t5","[Private security activities]","i6","Solid Waste","ü","","",""]
[null,null,"t6i1","t6","[Investigation activities]","i1","Violence and security issues","","ü","ü","ü"]
[null,null,"t6i2","t6","[Investigation activities]","i2","Labour Rights",null,"ü","ü","ü"]
[null,null,"t6i3","t6","[Investigation activities]","i3","Occupational Health and Safety ","","ü","ü"]
[null,null,"t6i4","t6","[Investigation activities]","i4","Community and Social Risks",null,"","","ü"]
[null,null,"t6i5","t6","[Investigation activities]","i5","Energy Consumption","ü",null,null,""]
[null,null,"t6i6","t6","[Investigation activities]","i6","Solid Waste","ü","","",""]
[null,null,"t7i1","t7","[Activities of collection agencies and credit bureaus]","i1","Violence and security issues","","ü","ü","ü"]
[null,null,"t7i2","t7","[Activities of collection agencies and credit bureaus]","i2","Labour Rights",null,"ü","ü","ü"]
[null,null,"t7i3","t7","[Activities of collection agencies and credit bureaus]","i3","Occupational Health and Safety ","","ü","ü"]
[null,null,"t7i4","t7","[Activities of collection agencies and credit bureaus]","i4","Community and Social Risks",null,"","","ü"]
[null,null,"t7i5","t7","[Activities of collection agencies and credit bureaus]","i5","Energy Consumption","ü",null,null,""]
[null,null,"t7i6","t7","[Activities of collection agencies and credit bureaus]","i6","Solid Waste","ü","","",""]
[null,null,"t8i1","t8","[Activities of households as employers of domestic personnel]","i1","Occupational Health and Safety ",null,"ü","ü",""]
[null,null,"t8i2","t8","[Activities of households as employers of domestic personnel]","i2","Community and Social Risks",null,null,"ü","ü"]
[null,null,"t8i3","t8","[Activities of households as employers of domestic personnel]","i3","Labour Rights",null,"","ü",""]
[null,null,"t9i1","t9","[Social work activities without accommodation]","i1","Violence and security issues","","ü","ü",""]
[null,null,"t9i2","t9","[Social work activities without accommodation]","i2","Occupational Health and Safety ",null,"ü","ü",""]
[null,null,"t9i3","t9","[Social work activities without accommodation]","i3","Labour Rights",null,"","ü",""]
[null,null,"t9i4","t9","[Social work activities without accommodation]","i4","Community and Social Risks",null,null,null,"ü"]
[null,null,"t10i1","t10","[Combined facilities support activities]","i1","Labour Rights","","","ü","ü"]
[null,null,"t10i2","t10","[Combined facilities support activities]","i2","Occupational Health and Safety ","","ü","ü"]
[null,null,"t10i3","t10","[Combined facilities support activities]","i3","Community and Social Risks",null,"","","ü"]
[null,null,"t10i4","t10","[Combined facilities support activities]","i4","Energy Consumption","ü","","",""]
[null,null,"t10i5","t10","[Combined facilities support activities]","i5","Solid Waste","ü","","",""]
[null,null,"t10i6","t10","[Combined facilities support activities]","i6","Air Emissions","ü"]
[null,null,"t10i7","t10","[Combined facilities support activities]","i7","Fire/Explosion risk",null,"ü","ü","ü"]
[null,null,"t10i8","t10","[Combined facilities support activities]","i8","Hazardous Materials",null,"ü","ü"]
[null,null,"t10i9","t10","[Combined facilities support activities]","i9","Water management and wastewater","ü","","",""]
[null,null,"t11i1","t11","[Retail sale of flowers, plants, seeds, fertilisers, pet animals and pet food in specialised stores]","i1","Labour Rights",null,"","ü","ü"]
[null,null,"t11i2","t11","[Retail sale of flowers, plants, seeds, fertilisers, pet animals and pet food in specialised stores]","i2","Occupational Health and Safety ",null,"ü","ü"]
[null,null,"t11i3","t11","[Retail sale of flowers, plants, seeds, fertilisers, pet animals and pet food in specialised stores]","i3","Energy Consumption","ü","",""]
[null,null,"t11i4","t11","[Retail sale of flowers, plants, seeds, fertilisers, pet animals and pet food in specialised stores]","i4","Solid Waste","ü","","",""]
[null,null,"t11i5","t11","[Retail sale of flowers, plants, seeds, fertilisers, pet animals and pet food in specialised stores]","i5","Hazardous Materials","ü","ü",null,""]
[null,null,"t11i6","t11","[Retail sale of flowers, plants, seeds, fertilisers, pet animals and pet food in specialised stores]","i6","Distribution and Transport","ü",null,"","ü"]
[null,null,"t11i7","t11","[Retail sale of flowers, plants, seeds, fertilisers, pet animals and pet food in specialised stores]","i7","Bioethics",null,"",null,"ü"]
[null,null,{"$f":"D70&F70","v":"t11i8"},"t11","[Retail sale of flowers, plants, seeds, fertilisers, pet animals and pet food in specialised stores]","i8","Fire/Explosion risk",null,"ü","ü",""]
[null,null,"t11i9","t11","[Retail sale of flowers, plants, seeds, fertilisers, pet animals and pet food in specialised stores]","i9","Threats to/from biodiversity","ü","","",""]
[null,null,"t11i10","t11","[Retail sale of flowers, plants, seeds, fertilisers, pet animals and pet food in specialised stores]","i10","Water management and wastewater","ü","","",""]
[null,null,"t12i1","t12","[Manufacture of prepared pet foods]","i1","Labour Rights",null,"","ü","ü"]
[null,null,"t12i2","t12","[Manufacture of prepared pet foods]","i2","Occupational Health and Safety ",null,"ü","ü",""]
[null,null,"t12i3","t12","[Manufacture of prepared pet foods]","i3","Hazardous Materials","ü","ü",null,""]
[null,null,"t12i4","t12","[Manufacture of prepared pet foods]","i4","Solid Waste","ü","","",""]
[null,null,"t12i5","t12","[Manufacture of prepared pet foods]","i5","Energy Consumption","ü","",""]
[null,null,"t12i6","t12","[Manufacture of prepared pet foods]","i6","Soil and Surface Water Contamination","ü",null,""]
[null,null,"t12i7","t12","[Manufacture of prepared pet foods]","i7","Water management and wastewater","ü",null,"",""]
[null,null,"t12i8","t12","[Manufacture of prepared pet foods]","i8","Distribution and Transport","ü",null,"","ü"]
[null,null,"t12i9","t12","[Manufacture of prepared pet foods]","i9","Community and Social Risks","","",null,"ü"]
[null,null,"t12i10","t12","[Manufacture of prepared pet foods]","i10","Threats to/from biodiversity","ü","","",""]
[null,null,"t12i11","t12","[Manufacture of prepared pet foods]","i11","Air Emissions","ü"]
[null,null,"t13i1","t13","[Gathering of wild growing non-wood products]","i1","Threats to/from biodiversity","ü","",null,"ü"]
[null,null,"t13i2","t13","[Gathering of wild growing non-wood products]","i2","Labour Rights",null,"","ü","ü"]
[null,null,"t13i3","t13","[Gathering of wild growing non-wood products]","i3","Occupational Health and Safety ",null,"ü","ü",""]
[null,null,"t13i4","t13","[Gathering of wild growing non-wood products]","i4","Distribution and Transport","ü",null,"","ü"]
[null,null,"t13i5","t13","[Gathering of wild growing non-wood products]","i5","Solid Waste","ü","","",""]
[null,null,"t13i6","t13","[Gathering of wild growing non-wood products]","i6","Water management and wastewater","ü","","",""]
[null,null,"t13i7","t13","[Gathering of wild growing non-wood products]","i7","Community and Social Risks","","",null,"ü"]
[null,null,"t14i1","t14","[Human health activities]","i1","Occupational Health and Safety ",null,"ü","ü",""]
[null,null,"t14i2","t14","[Human health activities]","i2","Solid Waste","ü","ü",null,""]
[null,null,"t14i3","t14","[Human health activities]","i3","Hazardous Materials","ü","ü",null,""]
[null,null,"t14i4","t14","[Human health activities]","i4","Soil and Surface Water Contamination","ü","ü"]
[null,null,"t14i5","t14","[Human health activities]","i5","Energy Consumption","ü"]
[null,null,"t14i6","t14","[Human health activities]","i6","Bioethics","","",null,"ü"]
[null,null,"t14i7","t14","[Human health activities]","i7","Labour Rights",null,null,"ü","ü"]
[null,null,"t14i8","t14","[Human health activities]","i8","Violence and security issues","","","ü",""]
[null,null,"t14i9","t14","[Human health activities]","i9","Community and Social Risks",null,null,null,"ü"]
[null,null,"t15i1","t15","[Residential care activities]","i1","Occupational Health and Safety ",null,"ü","ü",""]
[null,null,"t15i2","t15","[Residential care activities]","i2","Solid Waste","ü","ü",null,""]
[null,null,"t15i3","t15","[Residential care activities]","i3","Hazardous Materials","ü","ü",null,""]
[null,null,"t15i4","t15","[Residential care activities]","i4","Soil and Surface Water Contamination","ü","ü"]
[null,null,"t15i5","t15","[Residential care activities]","i5","Energy Consumption","ü"]
[null,null,"t15i6","t15","[Residential care activities]","i6","Bioethics","","",null,"ü"]
[null,null,"t15i7","t15","[Residential care activities]","i7","Labour Rights",null,null,"ü","ü"]
[null,null,"t15i8","t15","[Residential care activities]","i8","Violence and security issues","","","ü",""]
[null,null,"t15i9","t15","[Residential care activities]","i9","Community and Social Risks",null,null,null,"ü"]
[null,null,"t16i1","t16","[Manufacture of soap and detergents, cleaning and polishing preparations, perfumes and toilet preparations]","i1","Soil and Surface Water Contamination","ü",null,"","ü"]
[null,null,"t16i2","t16","[Manufacture of soap and detergents, cleaning and polishing preparations, perfumes and toilet preparations]","i2","Occupational Health and Safety ",null,"ü","ü",""]
[null,null,"t16i3","t16","[Manufacture of soap and detergents, cleaning and polishing preparations, perfumes and toilet preparations]","i3","Fire/Explosion risk","ü","ü","ü","ü"]
[null,null,"t16i4","t16","[Manufacture of soap and detergents, cleaning and polishing preparations, perfumes and toilet preparations]","i4","Water management and wastewater","ü","ü","",""]
[null,null,"t16i5","t16","[Manufacture of soap and detergents, cleaning and polishing preparations, perfumes and toilet preparations]","i5","Air Emissions","ü","ü"]
[null,null,"t16i6","t16","[Manufacture of soap and detergents, cleaning and polishing preparations, perfumes and toilet preparations]","i6","Hazardous Materials","ü","ü",null,""]
[null,null,"t16i7","t16","[Manufacture of soap and detergents, cleaning and polishing preparations, perfumes and toilet preparations]","i7","Solid Waste","ü","ü","",""]
[null,null,"t16i8","t16","[Manufacture of soap and detergents, cleaning and polishing preparations, perfumes and toilet preparations]","i8","Distribution and Transport","ü",null,"","ü"]
[null,null,"t16i9","t16","[Manufacture of soap and detergents, cleaning and polishing preparations, perfumes and toilet preparations]","i9","Energy Consumption","ü","",""]
[null,null,"t16i10","t16","[Manufacture of soap and detergents, cleaning and polishing preparations, perfumes and toilet preparations]","i10","Labour Rights",null,"","ü","ü"]
[null,null,"t16i11","t16","[Manufacture of soap and detergents, cleaning and polishing preparations, perfumes and toilet preparations]","i11","Community and Social Risks","",null,null,"ü"]
[null,null,"t17i1","t17","[Wholesale of chemical products]","i1","Fire/Explosion risk","ü","ü","ü","ü"]
[null,null,"t17i2","t17","[Wholesale of chemical products]","i2","Soil and Surface Water Contamination","ü","ü","","ü"]
[null,null,"t17i3","t17","[Wholesale of chemical products]","i3","Occupational Health and Safety ",null,"ü","ü",""]
[null,null,"t17i4","t17","[Wholesale of chemical products]","i4","Hazardous Materials","ü","ü",null,""]
[null,null,"t17i5","t17","[Wholesale of chemical products]","i5","Air Emissions","ü","ü"]
[null,null,"t17i6","t17","[Wholesale of chemical products]","i6","Distribution and Transport","ü",null,"","ü"]
[null,null,"t18i1","t18","[Manufacture of coke oven products]","i1","Soil and Surface Water Contamination","ü","ü","","ü"]
[null,null,"t18i2","t18","[Manufacture of coke oven products]","i2","Air Emissions","ü","ü",null,"ü"]
[null,null,"t18i3","t18","[Manufacture of coke oven products]","i3","Fire/Explosion risk",null,"ü","",""]
[null,null,"t18i4","t18","[Manufacture of coke oven products]","i4","Labour Rights",null,"","ü","ü"]
[null,null,"t18i5","t18","[Manufacture of coke oven products]","i5","Occupational Health and Safety ",null,"ü","ü",""]
[null,null,"t18i6","t18","[Manufacture of coke oven products]","i6","Hazardous Materials","ü","ü",null,""]
[null,null,"t18i7","t18","[Manufacture of coke oven products]","i7","Solid Waste","ü","ü","",""]
[null,null,"t18i8","t18","[Manufacture of coke oven products]","i8","Water management and wastewater","ü","","",""]
[null,null,{"$f":"D134&F134","v":"t18i9"},"t18","[Manufacture of coke oven products]","i9","Energy Consumption","ü","",""]
[null,null,"t18i10","t18","[Manufacture of coke oven products]","i10","Distribution and Transport","ü",null,"","ü"]
[null,null,"t18i11","t18","[Manufacture of coke oven products]","i11","Community and Social Risks","","",null,"ü"]
[null,null,"t19i1","t19","[Steam and air conditioning supply]","i1","Occupational Health and Safety ",null,"ü","ü",""]
[null,null,"t19i2","t19","[Steam and air conditioning supply]","i2","Fire/Explosion risk",null,"ü","","ü"]
[null,null,"t19i3","t19","[Steam and air conditioning supply]","i3","Hazardous Materials","ü","ü"]
[null,null,"t19i4","t19","[Steam and air conditioning supply]","i4","Soil and Surface Water Contamination","ü","ü","","ü"]
[null,null,"t19i5","t19","[Steam and air conditioning supply]","i5","Air Emissions","ü",null,null,"ü"]
[null,null,"t19i6","t19","[Steam and air conditioning supply]","i6","Water management and wastewater","ü","","","ü"]
[null,null,"t19i7","t19","[Steam and air conditioning supply]","i7","Solid Waste","ü","","",""]
[null,null,"t19i8","t19","[Steam and air conditioning supply]","i8","Distribution and Transport",null,"ü","","ü"]
[null,null,"t19i9","t19","[Steam and air conditioning supply]","i9","Community and Social Risks","","",null,"ü"]
[null,null,"t19i10","t19","[Steam and air conditioning supply]","i10","Energy Consumption","ü","",""]
[null,null,"t20i1","t20","[Manufacture of other food products (sugar, cocoa, ...]","i1","Soil and Surface Water Contamination","ü",null,""]
[null,null,"t20i2","t20","[Manufacture of other food products (sugar, cocoa, ...]","i2","Occupational Health and Safety ",null,"ü","ü",""]
[null,null,"t20i3","t20","[Manufacture of other food products (sugar, cocoa, ...]","i3","Labour Rights",null,"","ü","ü"]
[null,null,"t20i4","t20","[Manufacture of other food products (sugar, cocoa, ...]","i4","Fire/Explosion risk","ü","ü","",""]
[null,null,"t20i5","t20","[Manufacture of other food products (sugar, cocoa, ...]","i5","Solid Waste","ü","","",""]
[null,null,"t20i6","t20","[Manufacture of other food products (sugar, cocoa, ...]","i6","Hazardous Materials","ü","ü",null,""]
[null,null,"t20i7","t20","[Manufacture of other food products (sugar, cocoa, ...]","i7","Water management and wastewater","ü","","",""]
[null,null,"t20i8","t20","[Manufacture of other food products (sugar, cocoa, ...]","i8","Air Emissions","ü"]
[null,null,"t20i9","t20","[Manufacture of other food products (sugar, cocoa, ...]","i9","Energy Consumption","ü","",""]
[null,null,"t20i10","t20","[Manufacture of other food products (sugar, cocoa, ...]","i10","Distribution and Transport","ü",null,"","ü"]
[null,null,"t20i11","t20","[Manufacture of other food products (sugar, cocoa, ...]","i11","Threats to/from biodiversity","ü","","",""]
[null,null,"t20i12","t20","[Manufacture of other food products (sugar, cocoa, ...]","i12","Community and Social Risks","",null,null,"ü"]
[null,null,"t21i1","t21","[Manufacture of clay building materials (ceramic tiles, and flags, bricks, tiles and construction products, in baked clay)]","i1","Air Emissions","ü","ü"]
[null,null,"t21i2","t21","[Manufacture of clay building materials (ceramic tiles, and flags, bricks, tiles and construction products, in baked clay)]","i2","Soil and Surface Water Contamination","ü","ü",""]
[null,null,"t21i3","t21","[Manufacture of clay building materials (ceramic tiles, and flags, bricks, tiles and construction products, in baked clay)]","i3","Energy Consumption","ü","",""]
[null,null,"t21i4","t21","[Manufacture of clay building materials (ceramic tiles, and flags, bricks, tiles and construction products, in baked clay)]","i4","Solid Waste","ü",null,"",""]
[null,null,"t21i5","t21","[Manufacture of clay building materials (ceramic tiles, and flags, bricks, tiles and construction products, in baked clay)]","i5","Water management and wastewater","ü","","",""]
[null,null,"t21i6","t21","[Manufacture of clay building materials (ceramic tiles, and flags, bricks, tiles and construction products, in baked clay)]","i6","Hazardous Materials","ü","ü",null,""]
[null,null,"t21i7","t21","[Manufacture of clay building materials (ceramic tiles, and flags, bricks, tiles and construction products, in baked clay)]","i7","Fire/Explosion risk","ü","ü",null,""]
[null,null,"t21i8","t21","[Manufacture of clay building materials (ceramic tiles, and flags, bricks, tiles and construction products, in baked clay)]","i8","Occupational Health and Safety ",null,"ü","ü",""]
[null,null,"t21i9","t21","[Manufacture of clay building materials (ceramic tiles, and flags, bricks, tiles and construction products, in baked clay)]","i9","Labour Rights",null,"","ü","ü"]
[null,null,"t21i10","t21","[Manufacture of clay building materials (ceramic tiles, and flags, bricks, tiles and construction products, in baked clay)]","i10","Distribution and Transport","ü",null,"","ü"]
[null,null,"t21i11","t21","[Manufacture of clay building materials (ceramic tiles, and flags, bricks, tiles and construction products, in baked clay)]","i11","Community and Social Risks","","",null,"ü"]
[null,null,"t22i1","t22","[Manufacture of porcelain and ceramic products (...]","i1","Air Emissions","ü","ü"]
[null,null,"t22i2","t22","[Manufacture of porcelain and ceramic products (...]","i2","Soil and Surface Water Contamination","ü","ü",""]
[null,null,"t22i3","t22","[Manufacture of porcelain and ceramic products (...]","i3","Solid Waste","ü",null,"",""]
[null,null,"t22i4","t22","[Manufacture of porcelain and ceramic products (...]","i4","Fire/Explosion risk","ü","ü",null,""]
[null,null,"t22i5","t22","[Manufacture of porcelain and ceramic products (...]","i5","Energy Consumption","ü","",""]
[null,null,"t22i6","t22","[Manufacture of porcelain and ceramic products (...]","i6","Water management and wastewater","ü","","",""]
[null,null,"t22i7","t22","[Manufacture of porcelain and ceramic products (...]","i7","Hazardous Materials","ü","ü",null,""]
[null,null,"t22i8","t22","[Manufacture of porcelain and ceramic products (...]","i8","Occupational Health and Safety ",null,"ü","ü",""]
[null,null,"t22i9","t22","[Manufacture of porcelain and ceramic products (...]","i9","Labour Rights",null,"","ü","ü"]
[null,null,"t22i10","t22","[Manufacture of porcelain and ceramic products (...]","i10","Distribution and Transport","ü",null,"","ü"]
[null,null,"t22i11","t22","[Manufacture of porcelain and ceramic products (...]","i11","Community and Social Risks","","",null,"ü"]
[null,null,"t23i1","t23","[Manufacture of man-made fibres]","i1","Air Emissions","ü","ü"]
[null,null,"t23i2","t23","[Manufacture of man-made fibres]","i2","Soil and Surface Water Contamination","ü","ü",""]
[null,null,"t23i3","t23","[Manufacture of man-made fibres]","i3","Fire/Explosion risk","ü","ü",null,""]
[null,null,"t23i4","t23","[Manufacture of man-made fibres]","i4","Solid Waste","ü",null,"",""]
[null,null,"t23i5","t23","[Manufacture of man-made fibres]","i5","Energy Consumption","ü","",""]
[null,null,"t23i6","t23","[Manufacture of man-made fibres]","i6","Water management and wastewater","ü","","",""]
[null,null,"t23i7","t23","[Manufacture of man-made fibres]","i7","Hazardous Materials","ü","ü",null,""]
[null,null,"t23i8","t23","[Manufacture of man-made fibres]","i8","Occupational Health and Safety ",null,"ü","ü",""]
[null,null,"t23i9","t23","[Manufacture of man-made fibres]","i9","Labour Rights",null,"","ü","ü"]
[null,null,"t23i10","t23","[Manufacture of man-made fibres]","i10","Distribution and Transport","ü",null,"","ü"]
[null,null,"t23i11","t23","[Manufacture of man-made fibres]","i11","Community and Social Risks","","",null,"ü"]
[null,null,"t24i1","t24","[Manufacture of office machinery and equipment (except computers and peripheral equipment)]","i1","Air Emissions","ü","ü"]
[null,null,"t24i2","t24","[Manufacture of office machinery and equipment (except computers and peripheral equipment)]","i2","Soil and Surface Water Contamination","ü","ü",""]
[null,null,"t24i3","t24","[Manufacture of office machinery and equipment (except computers and peripheral equipment)]","i3","Solid Waste","ü",null,"",""]
[null,null,"t24i4","t24","[Manufacture of office machinery and equipment (except computers and peripheral equipment)]","i4","Hazardous Materials","ü","ü",null,""]
[null,null,"t24i5","t24","[Manufacture of office machinery and equipment (except computers and peripheral equipment)]","i5","Occupational Health and Safety ",null,"ü","ü",""]
[null,null,"t24i6","t24","[Manufacture of office machinery and equipment (except computers and peripheral equipment)]","i6","Labour Rights",null,"","ü","ü"]
[null,null,{"$f":"D198&F198","v":"t24i7"},"t24","[Manufacture of office machinery and equipment (except computers and peripheral equipment)]","i7","Distribution and Transport","ü",null,"","ü"]
[null,null,"t24i8","t24","[Manufacture of office machinery and equipment (except computers and peripheral equipment)]","i8","Energy Consumption","ü","",""]
[null,null,"t24i9","t24","[Manufacture of office machinery and equipment (except computers and peripheral equipment)]","i9","Community and Social Risks","","",null,"ü"]
[null,null,"t25i1","t25","[Manufacturing n.e.c. (brooms and brushes, ...]","i1","Labour Rights",null,"","ü","ü"]
[null,null,"t25i2","t25","[Manufacturing n.e.c. (brooms and brushes, ...]","i2","Occupational Health and Safety ",null,"ü","ü",""]
[null,null,"t25i3","t25","[Manufacturing n.e.c. (brooms and brushes, ...]","i3","Energy Consumption","ü","",""]
[null,null,"t25i4","t25","[Manufacturing n.e.c. (brooms and brushes, ...]","i4","Soil and Surface Water Contamination","ü","ü",""]
[null,null,"t25i5","t25","[Manufacturing n.e.c. (brooms and brushes, ...]","i5","Solid Waste","ü",null,"",""]
[null,null,"t25i6","t25","[Manufacturing n.e.c. (brooms and brushes, ...]","i6","Hazardous Materials","ü","ü",null,""]
[null,null,"t25i7","t25","[Manufacturing n.e.c. (brooms and brushes, ...]","i7","Distribution and Transport","ü",null,"","ü"]
[null,null,"t25i8","t25","[Manufacturing n.e.c. (brooms and brushes, ...]","i8","Community and Social Risks","","",null,"ü"]
[null,null,"t26i1","t26","[Manufacturing of jewellery, bijouteries and related articles]","i1","Labour Rights",null,"","ü","ü"]
[null,null,"t26i2","t26","[Manufacturing of jewellery, bijouteries and related articles]","i2","Occupational Health and Safety ",null,"ü","ü",""]
[null,null,"t26i3","t26","[Manufacturing of jewellery, bijouteries and related articles]","i3","Energy Consumption","ü","",""]
[null,null,"t26i4","t26","[Manufacturing of jewellery, bijouteries and related articles]","i4","Soil and Surface Water Contamination","ü","ü",""]
[null,null,"t26i5","t26","[Manufacturing of jewellery, bijouteries and related articles]","i5","Solid Waste","ü",null,"",""]
[null,null,"t26i6","t26","[Manufacturing of jewellery, bijouteries and related articles]","i6","Hazardous Materials","ü","ü",null,""]
[null,null,"t26i7","t26","[Manufacturing of jewellery, bijouteries and related articles]","i7","Distribution and Transport","ü",null,"","ü"]
[null,null,"t26i8","t26","[Manufacturing of jewellery, bijouteries and related articles]","i8","Community and Social Risks","","",null,"ü"]
[null,null,"t26i9","t26","[Manufacturing of jewellery, bijouteries and related articles]","i9","Violence and security issues",null,"ü","ü"]
[null,null,"t27i1","t27","[Manufacture of games and toys]","i1","Labour Rights",null,"","ü","ü"]
[null,null,"t27i2","t27","[Manufacture of games and toys]","i2","Occupational Health and Safety ",null,"ü","ü",""]
[null,null,"t27i3","t27","[Manufacture of games and toys]","i3","Hazardous Materials","ü","ü",null,""]
[null,null,"t27i4","t27","[Manufacture of games and toys]","i4","Soil and Surface Water Contamination","ü","ü",""]
[null,null,"t27i5","t27","[Manufacture of games and toys]","i5","Solid Waste","ü",null,"",""]
[null,null,"t27i6","t27","[Manufacture of games and toys]","i6","Distribution and Transport","ü",null,"","ü"]
[null,null,"t27i7","t27","[Manufacture of games and toys]","i7","Community and Social Risks","","",null,"ü"]
[null,null,"t27i8","t27","[Manufacture of games and toys]","i8","Energy Consumption","ü","",""]
[null,null,"t27i9","t27","[Manufacture of games and toys]","i9","Fire/Explosion risk","ü","ü",null,""]
[null,null,"t28i1","t28","[Manufacture of products of wood, cork, straw and plaiting materials (veneer sheets and wood-based panels, ...]","i1","Labour Rights",null,"","ü","ü"]
[null,null,"t28i2","t28","[Manufacture of products of wood, cork, straw and plaiting materials (veneer sheets and wood-based panels, ...]","i2","Occupational Health and Safety ",null,"ü","ü",""]
[null,null,"t28i3","t28","[Manufacture of products of wood, cork, straw and plaiting materials (veneer sheets and wood-based panels, ...]","i3","Hazardous Materials","ü","ü",null,""]
[null,null,"t28i4","t28","[Manufacture of products of wood, cork, straw and plaiting materials (veneer sheets and wood-based panels, ...]","i4","Energy Consumption","ü","",""]
[null,null,"t28i5","t28","[Manufacture of products of wood, cork, straw and plaiting materials (veneer sheets and wood-based panels, ...]","i5","Soil and Surface Water Contamination","ü","ü",""]
[null,null,"t28i6","t28","[Manufacture of products of wood, cork, straw and plaiting materials (veneer sheets and wood-based panels, ...]","i6","Solid Waste","ü","ü","",""]
[null,null,"t28i7","t28","[Manufacture of products of wood, cork, straw and plaiting materials (veneer sheets and wood-based panels, ...]","i7","Fire/Explosion risk","ü","ü",null,""]
[null,null,"t28i8","t28","[Manufacture of products of wood, cork, straw and plaiting materials (veneer sheets and wood-based panels, ...]","i8","Distribution and Transport","ü",null,"","ü"]
[null,null,"t28i9","t28","[Manufacture of products of wood, cork, straw and plaiting materials (veneer sheets and wood-based panels, ...]","i9","Community and Social Risks","","",null,"ü"]
[null,null,"t29i1","t29","[Manufacture of musical instruments]","i1","Labour Rights",null,"","ü","ü"]
[null,null,"t29i2","t29","[Manufacture of musical instruments]","i2","Occupational Health and Safety ",null,"ü","ü",""]
[null,null,"t29i3","t29","[Manufacture of musical instruments]","i3","Hazardous Materials","ü","ü",null,""]
[null,null,"t29i4","t29","[Manufacture of musical instruments]","i4","Soil and Surface Water Contamination","ü","ü",""]
[null,null,"t29i5","t29","[Manufacture of musical instruments]","i5","Solid Waste","ü",null,"",""]
[null,null,"t29i6","t29","[Manufacture of musical instruments]","i6","Distribution and Transport","ü",null,"","ü"]
[null,null,"t29i7","t29","[Manufacture of musical instruments]","i7","Energy Consumption","ü","",""]
[null,null,"t29i8","t29","[Manufacture of musical instruments]","i8","Fire/Explosion risk","ü","ü",null,""]
[null,null,"t29i9","t29","[Manufacture of musical instruments]","i9","Community and Social Risks","","",null,"ü"]
[null,null,"t30i1","t30","[Manufacture of sports goods]","i1","Labour Rights",null,"","ü","ü"]
[null,null,"t30i2","t30","[Manufacture of sports goods]","i2","Occupational Health and Safety ",null,"ü","ü",""]
[null,null,"t30i3","t30","[Manufacture of sports goods]","i3","Hazardous Materials","ü","ü",null,""]
[null,null,"t30i4","t30","[Manufacture of sports goods]","i4","Energy Consumption","ü","",""]
[null,null,"t30i5","t30","[Manufacture of sports goods]","i5","Soil and Surface Water Contamination","ü","ü",""]
[null,null,"t30i6","t30","[Manufacture of sports goods]","i6","Solid Waste","ü",null,"",""]
[null,null,"t30i7","t30","[Manufacture of sports goods]","i7","Distribution and Transport","ü",null,"","ü"]
[null,null,"t30i8","t30","[Manufacture of sports goods]","i8","Air Emissions","ü","ü"]
[null,null,"t30i9","t30","[Manufacture of sports goods]","i9","Fire/Explosion risk","ü","ü",null,""]
[null,null,"t30i10","t30","[Manufacture of sports goods]","i10","Community and Social Risks","","",null,"ü"]
[null,null,"t31i1","t31","[Manufacture of cutlery]","i1","Labour Rights",null,"","ü","ü"]
[null,null,"t31i2","t31","[Manufacture of cutlery]","i2","Occupational Health and Safety ",null,"ü","ü",""]
[null,null,"t31i3","t31","[Manufacture of cutlery]","i3","Hazardous Materials","ü","ü",null,""]
[null,null,"t31i4","t31","[Manufacture of cutlery]","i4","Energy Consumption","ü","",""]
[null,null,"t31i5","t31","[Manufacture of cutlery]","i5","Soil and Surface Water Contamination","ü","ü",""]
[null,null,"t31i6","t31","[Manufacture of cutlery]","i6","Solid Waste","ü","ü","",""]
[null,null,"t31i7","t31","[Manufacture of cutlery]","i7","Air Emissions","ü","ü"]
[null,null,{"$f":"D262&F262","v":"t31i8"},"t31","[Manufacture of cutlery]","i8","Fire/Explosion risk","ü","ü",null,""]
[null,null,"t31i9","t31","[Manufacture of cutlery]","i9","Distribution and Transport","ü",null,"","ü"]
[null,null,"t31i10","t31","[Manufacture of cutlery]","i10","Community and Social Risks","","",null,"ü"]
[null,null,"t32i1","t32","[Wholesale of metals and metal ores]","i1","Distribution and Transport","ü","ü","",""]
[null,null,"t32i2","t32","[Wholesale of metals and metal ores]","i2","Occupational Health and Safety ",null,"ü","ü",""]
[null,null,"t32i3","t32","[Wholesale of metals and metal ores]","i3","Labour Rights",null,"","ü","ü"]
[null,null,"t32i4","t32","[Wholesale of metals and metal ores]","i4","Hazardous Materials","ü","ü",null,""]
[null,null,"t32i5","t32","[Wholesale of metals and metal ores]","i5","Soil and Surface Water Contamination","ü","ü",""]
[null,null,"t32i6","t32","[Wholesale of metals and metal ores]","i6","Solid Waste","ü","ü","",""]
[null,null,"t33i1","t33","[Cutting, shaping and finishing of stone]","i1","Occupational Health and Safety ",null,"ü","ü",""]
[null,null,"t33i2","t33","[Cutting, shaping and finishing of stone]","i2","Water management and wastewater","ü","","",""]
[null,null,"t33i3","t33","[Cutting, shaping and finishing of stone]","i3","Energy Consumption","ü","",""]
[null,null,"t33i4","t33","[Cutting, shaping and finishing of stone]","i4","Solid Waste","ü","","",""]
[null,null,"t33i5","t33","[Cutting, shaping and finishing of stone]","i5","Labour Rights",null,"","ü"]
[null,null,"t33i6","t33","[Cutting, shaping and finishing of stone]","i6","Air Emissions",null,"ü",null,"ü"]
[null,null,"t33i7","t33","[Cutting, shaping and finishing of stone]","i7","Community and Social Risks","","",null,"ü"]
[null,null,"t34i1","t34","[Manufacture of abrasive products and non-metallic mineral products not elsewhere classified]","i1","Occupational Health and Safety ",null,"ü","ü",""]
[null,null,"t34i2","t34","[Manufacture of abrasive products and non-metallic mineral products not elsewhere classified]","i2","Labour Rights",null,"","ü",""]
[null,null,"t34i3","t34","[Manufacture of abrasive products and non-metallic mineral products not elsewhere classified]","i3","Energy Consumption","ü","",""]
[null,null,"t34i4","t34","[Manufacture of abrasive products and non-metallic mineral products not elsewhere classified]","i4","Solid Waste","ü","","","ü"]
[null,null,"t34i5","t34","[Manufacture of abrasive products and non-metallic mineral products not elsewhere classified]","i5","Water management and wastewater","ü","","",""]
[null,null,"t34i6","t34","[Manufacture of abrasive products and non-metallic mineral products not elsewhere classified]","i6","Hazardous Materials","ü","ü",null,""]
[null,null,"t34i7","t34","[Manufacture of abrasive products and non-metallic mineral products not elsewhere classified]","i7","Soil and Surface Water Contamination","ü","ü",""]
[null,null,"t34i8","t34","[Manufacture of abrasive products and non-metallic mineral products not elsewhere classified]","i8","Fire/Explosion risk","ü","ü","",""]
[null,null,"t34i9","t34","[Manufacture of abrasive products and non-metallic mineral products not elsewhere classified]","i9","Community and Social Risks","","",null,"ü"]
[null,null,"t34i10","t34","[Manufacture of abrasive products and non-metallic mineral products not elsewhere classified]","i10","Air Emissions","ü","ü"]
[null,null,"t35i1","t35","[Dismantling of wrecks]","i1","Hazardous Materials","ü","ü",null,""]
[null,null,"t35i2","t35","[Dismantling of wrecks]","i2","Soil and Surface Water Contamination","ü","ü","","ü"]
[null,null,"t35i3","t35","[Dismantling of wrecks]","i3","Occupational Health and Safety ",null,"ü","ü",""]
[null,null,"t35i4","t35","[Dismantling of wrecks]","i4","Distribution and Transport","ü","ü","","ü"]
[null,null,"t35i5","t35","[Dismantling of wrecks]","i5","Solid Waste","ü","","","ü"]
[null,null,"t35i6","t35","[Dismantling of wrecks]","i6","Fire/Explosion risk",null,"ü","","ü"]
[null,null,"t35i7","t35","[Dismantling of wrecks]","i7","Labour Rights",null,null,"ü","ü"]
[null,null,"t35i8","t35","[Dismantling of wrecks]","i8","Community and Social Risks","","",null,"ü"]
[null,null,"t36i1","t36","[Wholesale of waste and scrap]","i1","Distribution and Transport","ü",null,"",""]
[null,null,"t36i2","t36","[Wholesale of waste and scrap]","i2","Occupational Health and Safety ",null,"ü","ü",""]
[null,null,"t36i3","t36","[Wholesale of waste and scrap]","i3","Solid Waste","ü","ü","","ü"]
[null,null,"t36i4","t36","[Wholesale of waste and scrap]","i4","Hazardous Materials","ü","ü",null,""]
[null,null,"t36i5","t36","[Wholesale of waste and scrap]","i5","Fire/Explosion risk","ü","ü","",""]
[null,null,"t37i1","t37","[Wholesale of wood, construction materials and sanitary equipment]","i1","Fire/Explosion risk","ü","ü","","ü"]
[null,null,"t37i2","t37","[Wholesale of wood, construction materials and sanitary equipment]","i2","Soil and Surface Water Contamination","ü","ü","","ü"]
[null,null,"t37i3","t37","[Wholesale of wood, construction materials and sanitary equipment]","i3","Occupational Health and Safety ",null,"ü","ü",""]
[null,null,"t37i4","t37","[Wholesale of wood, construction materials and sanitary equipment]","i4","Hazardous Materials","ü","ü",null,""]
[null,null,"t37i5","t37","[Wholesale of wood, construction materials and sanitary equipment]","i5","Distribution and Transport","ü",null,"",""]
[null,null,"t37i6","t37","[Wholesale of wood, construction materials and sanitary equipment]","i6","Energy Consumption","ü","",""]
[null,null,"t37i7","t37","[Wholesale of wood, construction materials and sanitary equipment]","i7","Solid Waste","ü","",""]
[null,null,"t38i1","t38","[Space transport]","i1","Fire/Explosion risk","ü","ü",null,""]
[null,null,"t38i2","t38","[Space transport]","i2","Occupational Health and Safety ",null,"ü","ü",""]
[null,null,"t38i3","t38","[Space transport]","i3","Air Emissions","ü"]
[null,null,"t38i4","t38","[Space transport]","i4","Energy Consumption","ü","",""]
[null,null,"t38i5","t38","[Space transport]","i5","Alternative Fuels","ü",""]
[null,null,"t38i6","t38","[Space transport]","i6","Hazardous Materials","ü","ü",null,""]
[null,null,"t38i7","t38","[Space transport]","i7","Soil and Surface Water Contamination","ü","ü","","ü"]
[null,null,"t38i8","t38","[Space transport]","i8","Community and Social Risks","","",null,"ü"]
[null,null,"t38i9","t38","[Space transport]","i9","Distribution and Transport","ü",null,"","ü"]
[null,null,"t39i1","t39","[Repair and maintenance of other transport equipment]","i1","Occupational Health and Safety ",null,"ü","ü",""]
[null,null,"t39i2","t39","[Repair and maintenance of other transport equipment]","i2","Labour Rights",null,"","ü","ü"]
[null,null,"t39i3","t39","[Repair and maintenance of other transport equipment]","i3","Hazardous Materials","ü","ü",null,""]
[null,null,"t39i4","t39","[Repair and maintenance of other transport equipment]","i4","Solid Waste","ü","","","ü"]
[null,null,"t39i5","t39","[Repair and maintenance of other transport equipment]","i5","Alternative Fuels","ü",""]
[null,null,"t39i6","t39","[Repair and maintenance of other transport equipment]","i6","Air Emissions",null,"ü",null,"ü"]
[null,null,"t40i1","t40","[Warehousing and support activities for transportation]","i1","Labour Rights",null,"","ü",""]
[null,null,"t40i2","t40","[Warehousing and support activities for transportation]","i2","Fire/Explosion risk","ü","ü","",""]
[null,null,"t40i3","t40","[Warehousing and support activities for transportation]","i3","Occupational Health and Safety ",null,"ü","ü",""]
[null,null,{"$f":"D326&F326","v":"t40i4"},"t40","[Warehousing and support activities for transportation]","i4","Distribution and Transport","ü",null,"","ü"]
[null,null,"t40i5","t40","[Warehousing and support activities for transportation]","i5","Energy Consumption","ü","",""]
[null,null,"t40i6","t40","[Warehousing and support activities for transportation]","i6","Hazardous Materials","ü","ü",null,""]
[null,null,"t40i7","t40","[Warehousing and support activities for transportation]","i7","Soil and Surface Water Contamination","ü","ü","","ü"]
[null,null,"t40i8","t40","[Warehousing and support activities for transportation]","i8","Violence and security issues","","ü","",""]
[null,null,"t40i9","t40","[Warehousing and support activities for transportation]","i9","Solid Waste","ü","ü","",""]
[null,null,"t41i1","t41","[Manufacture of motor vehicles]","i1","Hazardous Materials","ü","ü","ü",""]
[null,null,"t41i2","t41","[Manufacture of motor vehicles]","i2","Energy Consumption","ü","",""]
[null,null,"t41i3","t41","[Manufacture of motor vehicles]","i3","Labour Rights",null,"","ü","ü"]
[null,null,"t41i4","t41","[Manufacture of motor vehicles]","i4","Occupational Health and Safety ",null,"ü","ü",""]
[null,null,"t41i5","t41","[Manufacture of motor vehicles]","i5","Distribution and Transport","ü",null,"",""]
[null,null,"t41i6","t41","[Manufacture of motor vehicles]","i6","Air Emissions","ü","ü"]
[null,null,"t41i7","t41","[Manufacture of motor vehicles]","i7","Soil and Surface Water Contamination","ü","ü",""]
[null,null,"t41i8","t41","[Manufacture of motor vehicles]","i8","Solid Waste","ü","","","ü"]
[null,null,"t41i9","t41","[Manufacture of motor vehicles]","i9","Fire/Explosion risk","ü","ü","",""]
[null,null,"t41i10","t41","[Manufacture of motor vehicles]","i10","Water management and wastewater","ü","ü","",""]
[null,null,"t42i1","t42","[Manufacture of transport equipment n.e.c. (e.g. motorcycles, bicycles and invalid carriages)]","i1","Hazardous Materials","ü","ü",null,""]
[null,null,"t42i2","t42","[Manufacture of transport equipment n.e.c. (e.g. motorcycles, bicycles and invalid carriages)]","i2","Energy Consumption","ü","",""]
[null,null,"t42i3","t42","[Manufacture of transport equipment n.e.c. (e.g. motorcycles, bicycles and invalid carriages)]","i3","Labour Rights",null,"","ü",""]
[null,null,"t42i4","t42","[Manufacture of transport equipment n.e.c. (e.g. motorcycles, bicycles and invalid carriages)]","i4","Occupational Health and Safety ",null,"ü","ü",""]
[null,null,"t42i5","t42","[Manufacture of transport equipment n.e.c. (e.g. motorcycles, bicycles and invalid carriages)]","i5","Distribution and Transport","ü",null,"",""]
[null,null,"t42i6","t42","[Manufacture of transport equipment n.e.c. (e.g. motorcycles, bicycles and invalid carriages)]","i6","Air Emissions","ü","ü"]
[null,null,"t42i7","t42","[Manufacture of transport equipment n.e.c. (e.g. motorcycles, bicycles and invalid carriages)]","i7","Soil and Surface Water Contamination","ü",null,""]
[null,null,"t42i8","t42","[Manufacture of transport equipment n.e.c. (e.g. motorcycles, bicycles and invalid carriages)]","i8","Solid Waste","ü","","","ü"]
[null,null,"t42i9","t42","[Manufacture of transport equipment n.e.c. (e.g. motorcycles, bicycles and invalid carriages)]","i9","Fire/Explosion risk","ü","ü","",""]
[null,null,"t42i10","t42","[Manufacture of transport equipment n.e.c. (e.g. motorcycles, bicycles and invalid carriages)]","i10","Water management and wastewater","ü","","",""]
[null,null,"t43i1","t43","[Extraction of crude petroleum]","i1","Occupational Health and Safety ",null,"ü","ü",""]
[null,null,"t43i2","t43","[Extraction of crude petroleum]","i2","Community and Social Risks","","",null,"ü"]
[null,null,"t43i3","t43","[Extraction of crude petroleum]","i3","Fire/Explosion risk","ü","ü","","ü"]
[null,null,"t43i4","t43","[Extraction of crude petroleum]","i4","Hazardous Materials","ü","ü",null,"ü"]
[null,null,"t43i5","t43","[Extraction of crude petroleum]","i5","Soil and Surface Water Contamination","ü","ü","","ü"]
[null,null,"t43i6","t43","[Extraction of crude petroleum]","i6","Water management and wastewater","ü","ü","","ü"]
[null,null,"t43i7","t43","[Extraction of crude petroleum]","i7","Air Emissions","ü","ü"]
[null,null,"t43i8","t43","[Extraction of crude petroleum]","i8","Solid Waste","ü","ü","",""]
[null,null,"t43i9","t43","[Extraction of crude petroleum]","i9","Threats to/from biodiversity","ü","","",""]
[null,null,"t43i10","t43","[Extraction of crude petroleum]","i10","Distribution and Transport","ü","ü","","ü"]
[null,null,"t43i11","t43","[Extraction of crude petroleum]","i11","Violence and security issues","ü","","","ü"]
[null,null,"t43i12","t43","[Extraction of crude petroleum]","i12","Labour Rights",null,"","ü","ü"]
[null,null,"t43i13","t43","[Extraction of crude petroleum]","i13","Energy Consumption","ü","",""]
[null,null,"t44i1","t44","[Extraction of natural gas]","i1","Occupational Health and Safety ",null,"ü","ü",""]
[null,null,"t44i2","t44","[Extraction of natural gas]","i2","Community and Social Risks","","",null,"ü"]
[null,null,"t44i3","t44","[Extraction of natural gas]","i3","Fire/Explosion risk","ü","ü","","ü"]
[null,null,"t44i4","t44","[Extraction of natural gas]","i4","Hazardous Materials","ü","ü",null,"ü"]
[null,null,"t44i5","t44","[Extraction of natural gas]","i5","Soil and Surface Water Contamination","ü","ü","","ü"]
[null,null,"t44i6","t44","[Extraction of natural gas]","i6","Water management and wastewater","ü","ü","","ü"]
[null,null,"t44i7","t44","[Extraction of natural gas]","i7","Air Emissions","ü","ü"]
[null,null,"t44i8","t44","[Extraction of natural gas]","i8","Solid Waste","ü","ü","",""]
[null,null,"t44i9","t44","[Extraction of natural gas]","i9","Threats to/from biodiversity","ü","","",""]
[null,null,"t44i10","t44","[Extraction of natural gas]","i10","Distribution and Transport","ü","ü","","ü"]
[null,null,"t44i11","t44","[Extraction of natural gas]","i11","Violence and security issues","ü","","","ü"]
[null,null,"t44i12","t44","[Extraction of natural gas]","i12","Labour Rights",null,"","ü","ü"]
[null,null,"t44i13","t44","[Extraction of natural gas]","i13","Energy Consumption","ü","",""]
[null,null,"t45i1","t45","[Support activities for petroleum and natural gas extraction]","i1","Occupational Health and Safety ",null,"ü","ü",""]
[null,null,"t45i2","t45","[Support activities for petroleum and natural gas extraction]","i2","Hazardous Materials","ü","ü",null,"ü"]
[null,null,"t45i3","t45","[Support activities for petroleum and natural gas extraction]","i3","Soil and Surface Water Contamination","ü","ü","","ü"]
[null,null,"t45i4","t45","[Support activities for petroleum and natural gas extraction]","i4","Water management and wastewater","ü","ü","",""]
[null,null,"t45i5","t45","[Support activities for petroleum and natural gas extraction]","i5","Air Emissions","ü"]
[null,null,"t45i6","t45","[Support activities for petroleum and natural gas extraction]","i6","Solid Waste","ü","ü","",""]
[null,null,"t45i7","t45","[Support activities for petroleum and natural gas extraction]","i7","Fire/Explosion risk","ü","ü","","ü"]
[null,null,"t45i8","t45","[Support activities for petroleum and natural gas extraction]","i8","Community and Social Risks","","",null,"ü"]
[null,null,"t45i9","t45","[Support activities for petroleum and natural gas extraction]","i9","Threats to/from biodiversity","ü","","",""]
[null,null,"t45i10","t45","[Support activities for petroleum and natural gas extraction]","i10","Distribution and Transport","ü","ü","","ü"]
[null,null,"t45i11","t45","[Support activities for petroleum and natural gas extraction]","i11","Violence and security issues","ü","","","ü"]
[null,null,"t45i12","t45","[Support activities for petroleum and natural gas extraction]","i12","Labour Rights",null,"","ü","ü"]
[null,null,{"$f":"D390&F390","v":"t46i1"},"t46","[Distribution of gaseous fuels through mains]","i1","Fire/Explosion risk","ü","ü","","ü"]
[null,null,"t46i2","t46","[Distribution of gaseous fuels through mains]","i2","Violence and security issues","ü","","","ü"]
[null,null,"t46i3","t46","[Distribution of gaseous fuels through mains]","i3","Occupational Health and Safety ",null,"ü","ü",""]
[null,null,"t46i4","t46","[Distribution of gaseous fuels through mains]","i4","Soil and Surface Water Contamination","ü","ü","","ü"]
[null,null,"t46i5","t46","[Distribution of gaseous fuels through mains]","i5","Air Emissions","ü"]
[null,null,"t46i6","t46","[Distribution of gaseous fuels through mains]","i6","Threats to/from biodiversity","ü","","",""]
[null,null,"t46i7","t46","[Distribution of gaseous fuels through mains]","i7","Community and Social Risks","","",null,"ü"]
[null,null,"t47i1","t47","[Manufacture of gas]","i1","Fire/Explosion risk","ü","ü","",""]
[null,null,"t47i2","t47","[Manufacture of gas]","i2","Occupational Health and Safety ",null,"ü","ü",""]
[null,null,"t47i3","t47","[Manufacture of gas]","i3","Soil and Surface Water Contamination","ü","ü","","ü"]
[null,null,"t47i4","t47","[Manufacture of gas]","i4","Air Emissions","ü"]
[null,null,"t47i5","t47","[Manufacture of gas]","i5","Hazardous Materials","ü",null,null,""]
[null,null,"t47i6","t47","[Manufacture of gas]","i6","Solid Waste","ü","","",""]
[null,null,"t47i7","t47","[Manufacture of gas]","i7","Energy Consumption","ü","",""]
[null,null,"t47i8","t47","[Manufacture of gas]","i8","Community and Social Risks","","",null,"ü"]
[null,null,"t48i1","t48","[Transport via pipeline]","i1","Fire/Explosion risk","ü","ü","",""]
[null,null,"t48i2","t48","[Transport via pipeline]","i2","Violence and security issues","ü","","","ü"]
[null,null,"t48i3","t48","[Transport via pipeline]","i3","Occupational Health and Safety ",null,"ü","ü",""]
[null,null,"t48i4","t48","[Transport via pipeline]","i4","Soil and Surface Water Contamination","ü","ü","","ü"]
[null,null,"t48i5","t48","[Transport via pipeline]","i5","Air Emissions","ü"]
[null,null,"t48i6","t48","[Transport via pipeline]","i6","Threats to/from biodiversity","ü","","",""]
[null,null,"t48i7","t48","[Transport via pipeline]","i7","Community and Social Risks","","",null,"ü"]
[null,null,"t49i1","t49","Demolition and Site Preparation","i1","Occupational Health and Safety ",null,"ü","ü",""]
[null,null,"t49i2","t49","Demolition and Site Preparation","i2","Fire/Explosion risk","ü","ü","","ü"]
[null,null,"t49i3","t49","Demolition and Site Preparation","i3","Solid Waste","ü","","",""]
[null,null,"t49i4","t49","Demolition and Site Preparation","i4","Soil and Surface Water Contamination","ü",null,""]
[null,null,"t49i5","t49","Demolition and Site Preparation","i5","Air Emissions","ü","ü",null,"ü"]
[null,null,"t49i6","t49","Demolition and Site Preparation","i6","Hazardous Materials","ü","ü",null,""]
[null,null,"t49i7","t49","Demolition and Site Preparation","i7","Distribution and Transport","ü",null,"","ü"]
[null,null,"t49i8","t49","Demolition and Site Preparation","i8","Violence and security issues","","ü","",""]
[null,null,"t49i9","t49","Demolition and Site Preparation","i9","Water management and wastewater","ü","","",""]
[null,null,"t50i1","t50","Manufacture of Batteries","i1","Hazardous Materials","ü","ü",null,""]
[null,null,"t50i2","t50","Manufacture of Batteries","i2","Fire/Explosion risk","ü","ü","",""]
[null,null,"t50i3","t50","Manufacture of Batteries","i3","Occupational Health and Safety ",null,"ü","ü",""]
[null,null,"t50i4","t50","Manufacture of Batteries","i4","Soil and Surface Water Contamination","ü","ü","","ü"]
[null,null,"t50i5","t50","Manufacture of Batteries","i5","Air Emissions","ü","ü",null,"ü"]
[null,null,"t50i6","t50","Manufacture of Batteries","i6","Energy Consumption","ü","",""]
[null,null,"t50i7","t50","Manufacture of Batteries","i7","Solid Waste","ü","","","ü"]
[null,null,"t50i8","t50","Manufacture of Batteries","i8","Water management and wastewater","ü","ü","",""]
[null,null,"t50i9","t50","Manufacture of Batteries","i9","Labour Rights",null,"","ü","ü"]
[null,null,"t50i10","t50","Manufacture of Batteries","i10","Distribution and Transport","ü",null,"","ü"]
[null,null,"t51i1","t51","Manufacture of Air and Spacecrafts","i1","Hazardous Materials","ü","ü",null,"ü"]
[null,null,"t51i2","t51","Manufacture of Air and Spacecrafts","i2","Occupational Health and Safety ",null,"ü","ü",""]
[null,null,"t51i3","t51","Manufacture of Air and Spacecrafts","i3","Energy Consumption","ü","",""]
[null,null,"t51i4","t51","Manufacture of Air and Spacecrafts","i4","Solid Waste","ü","","","ü"]
[null,null,"t51i5","t51","Manufacture of Air and Spacecrafts","i5","Air Emissions","ü","ü"]
[null,null,"t51i6","t51","Manufacture of Air and Spacecrafts","i6","Water management and wastewater","ü","","",""]
[null,null,"t51i7","t51","Manufacture of Air and Spacecrafts","i7","Labour Rights",null,"","ü","ü"]
[null,null,"t51i8","t51","Manufacture of Air and Spacecrafts","i8","Fire/Explosion risk",null,"ü",null,""]
[null,null,"t51i9","t51","Manufacture of Air and Spacecrafts","i9","Violence and security issues","","ü","",""]
[null,null,"t52i1","t52","Materials Recovery","i1","Hazardous Materials","ü","ü",null,"ü"]
[null,null,"t52i2","t52","Materials Recovery","i2","Soil and Surface Water Contamination","ü","ü","","ü"]
[null,null,"t52i3","t52","Materials Recovery","i3","Occupational Health and Safety ",null,"ü","ü",""]
[null,null,"t52i4","t52","Materials Recovery","i4","Air Emissions","ü","ü",null,"ü"]
[null,null,"t52i5","t52","Materials Recovery","i5","Fire/Explosion risk","ü","ü","","ü"]
[null,null,"t52i6","t52","Materials Recovery","i6","Distribution and Transport","ü",null,"","ü"]
[null,null,"t52i7","t52","Materials Recovery","i7","Labour Rights",null,"","ü",""]
[null,null,"t52i8","t52","Materials Recovery","i8","Solid Waste","ü","","","ü"]
[null,null,"t52i9","t52","Materials Recovery","i9","Water management and wastewater","ü","","",""]
[null,null,"t52i10","t52","Materials Recovery","i10","Community and Social Risks","","",null,"ü"]
[null,null,"t53i1","t53","Remediation Activities","i1","Hazardous Materials","ü","ü",null,"ü"]
[null,null,"t53i2","t53","Remediation Activities","i2","Occupational Health and Safety ",null,"ü","ü",""]
[null,null,"t53i3","t53","Remediation Activities","i3","Distribution and Transport","ü","ü","","ü"]
[null,null,"t53i4","t53","Remediation Activities","i4","Soil and Surface Water Contamination","ü","ü","","ü"]
[null,null,{"$f":"D454&F454","v":"t53i5"},"t53","Remediation Activities","i5","Solid Waste","ü","ü","",""]
[null,null,"t53i6","t53","Remediation Activities","i6","Water management and wastewater","ü","","","ü"]
[null,null,"t53i7","t53","Remediation Activities","i7","Threats to/from biodiversity","ü","","",""]
[null,null,"t53i8","t53","Remediation Activities","i8","Community and Social Risks","",null,null,"ü"]
[null,null,"t53i9","t53","Remediation Activities","i9","Air Emissions","ü"]
[null,null,"t54i1","t54","Waste Management and Disposal","i1","Hazardous Materials","ü","ü",null,"ü"]
[null,null,"t54i2","t54","Waste Management and Disposal","i2","Occupational Health and Safety ",null,"ü","ü",""]
[null,null,"t54i3","t54","Waste Management and Disposal","i3","Air Emissions","ü","ü",null,"ü"]
[null,null,"t54i4","t54","Waste Management and Disposal","i4","Distribution and Transport","ü",null,"","ü"]
[null,null,"t54i5","t54","Waste Management and Disposal","i5","Water management and wastewater","ü","","",""]
[null,null,"t54i6","t54","Waste Management and Disposal","i6","Community and Social Risks","","",null,"ü"]
[null,null,"t54i7","t54","Waste Management and Disposal","i7","Solid Waste","ü","ü","","ü"]
[null,null,"t55i1","t55","Water and Sanitation","i1","Water management and wastewater","ü","","","ü"]
[null,null,"t55i2","t55","Water and Sanitation","i2","Solid Waste","ü","ü","","ü"]
[null,null,"t55i3","t55","Water and Sanitation","i3","Occupational Health and Safety ",null,"ü","ü",""]
[null,null,"t55i4","t55","Water and Sanitation","i4","Air Emissions","ü","ü","","ü"]
[null,null,"t55i5","t55","Water and Sanitation","i5","Energy Consumption","ü","",""]
[null,null,"t55i6","t55","Water and Sanitation","i6","Community and Social Risks","","",null,"ü"]
[null,null,"t55i7","t55","Water and Sanitation","i7","Threats to/from biodiversity","ü",null,"",""]
[null,null,"t56i1","t56","Manufacture of Electrical Equipment and Goods","i1","Labour Rights",null,"","ü","ü"]
[null,null,"t56i2","t56","Manufacture of Electrical Equipment and Goods","i2","Hazardous Materials","ü","ü",null,"ü"]
[null,null,"t56i3","t56","Manufacture of Electrical Equipment and Goods","i3","Occupational Health and Safety ",null,"ü","ü",""]
[null,null,"t56i4","t56","Manufacture of Electrical Equipment and Goods","i4","Energy Consumption","ü","",""]
[null,null,"t56i5","t56","Manufacture of Electrical Equipment and Goods","i5","Solid Waste","ü","","","ü"]
[null,null,"t56i6","t56","Manufacture of Electrical Equipment and Goods","i6","Water management and wastewater","ü","","","ü"]
[null,null,"t56i7","t56","Manufacture of Electrical Equipment and Goods","i7","Air Emissions","ü","ü",null,"ü"]
[null,null,"t56i8","t56","Manufacture of Electrical Equipment and Goods","i8","Community and Social Risks",null,null,"","ü"]
[null,null,"t57i1","t57","Manufacture of Hi-Tech Products (Computers, Telephones)","i1","Labour Rights",null,"","ü","ü"]
[null,null,"t57i2","t57","Manufacture of Hi-Tech Products (Computers, Telephones)","i2","Hazardous Materials","ü","ü",null,"ü"]
[null,null,"t57i3","t57","Manufacture of Hi-Tech Products (Computers, Telephones)","i3","Occupational Health and Safety ",null,"ü","ü",""]
[null,null,"t57i4","t57","Manufacture of Hi-Tech Products (Computers, Telephones)","i4","Energy Consumption","ü","",""]
[null,null,"t57i5","t57","Manufacture of Hi-Tech Products (Computers, Telephones)","i5","Solid Waste","ü","","","ü"]
[null,null,"t57i6","t57","Manufacture of Hi-Tech Products (Computers, Telephones)","i6","Air Emissions","ü","ü"]
[null,null,"t57i7","t57","Manufacture of Hi-Tech Products (Computers, Telephones)","i7","Distribution and Transport","ü",null,"","ü"]
[null,null,"t57i8","t57","Manufacture of Hi-Tech Products (Computers, Telephones)","i8","Fire/Explosion risk","ü","ü","",""]
[null,null,"t58i1","t58","Telecommunications","i1","Occupational Health and Safety ",null,"ü","ü",""]
[null,null,"t58i2","t58","Telecommunications","i2","Energy Consumption","ü","",""]
[null,null,"t58i3","t58","Telecommunications","i3","Solid Waste","ü","","","ü"]
[null,null,"t58i4","t58","Telecommunications","i4","Habitat, Biodiversity and Community","ü","","","ü"]
[null,null,"t58i5","t58","Telecommunications","i5","Air Emissions","ü","ü",""]
[null,null,"t59i1","t59","Health Establishments and Health Services","i1","Hazardous Materials","ü","ü",null,""]
[null,null,"t59i2","t59","Health Establishments and Health Services","i2","Community and Social Risks","","",null,"ü"]
[null,null,"t59i3","t59","Health Establishments and Health Services","i3","Occupational Health and Safety ",null,"ü","ü",""]
[null,null,"t59i4","t59","Health Establishments and Health Services","i4","Violence and security issues","","","ü",""]
[null,null,"t59i5","t59","Health Establishments and Health Services","i5","Water management and wastewater","ü","","",""]
[null,null,"t59i6","t59","Health Establishments and Health Services","i6","Energy Consumption","ü","",""]
[null,null,"t59i7","t59","Health Establishments and Health Services","i7","Solid Waste","ü","","",""]
[null,null,"t59i8","t59","Health Establishments and Health Services","i8","Labour Rights",null,"","ü","ü"]
[null,null,"t59i9","t59","Health Establishments and Health Services","i9","Fire/Explosion risk","ü","ü","",""]
[null,null,"t60i1","t60","Dry-Cleaning","i1","Hazardous Materials","ü","ü",null,""]
[null,null,"t60i2","t60","Dry-Cleaning","i2","Occupational Health and Safety ",null,"ü","ü",""]
[null,null,"t60i3","t60","Dry-Cleaning","i3","Soil and Surface Water Contamination","ü","ü","","ü"]
[null,null,"t60i4","t60","Dry-Cleaning","i4","Air Emissions",null,"ü"]
[null,null,"t60i5","t60","Dry-Cleaning","i5","Fire/Explosion risk","ü","ü","",""]
[null,null,"t60i6","t60","Dry-Cleaning","i6","Energy Consumption","ü","",""]
[null,null,"t61i1","t61","Leasing","i1","Occupational Health and Safety ",null,"ü","ü",""]
[null,null,{"$f":"D510&F510","v":"t61i2"},"t61","Leasing","i2","Solid Waste","ü","","",""]
[null,null,"t61i3","t61","Leasing","i3","Energy Consumption","ü","",""]
[null,null,"t61i4","t61","Leasing","i4","Distribution and Transport","ü",null,"","ü"]
[null,null,"t62i1","t62","Manufacture of Chemicals","i1","Fire/Explosion risk","ü","ü","",""]
[null,null,"t62i2","t62","Manufacture of Chemicals","i2","Occupational Health and Safety ",null,"ü","ü",""]
[null,null,"t62i3","t62","Manufacture of Chemicals","i3","Hazardous Materials","ü","ü",null,"ü"]
[null,null,"t62i4","t62","Manufacture of Chemicals","i4","Soil and Surface Water Contamination","ü","ü",""]
[null,null,"t62i5","t62","Manufacture of Chemicals","i5","Water management and wastewater","ü","ü","",""]
[null,null,"t62i6","t62","Manufacture of Chemicals","i6","Air Emissions","ü","ü",null,"ü"]
[null,null,"t62i7","t62","Manufacture of Chemicals","i7","Distribution and Transport","ü","ü","","ü"]
[null,null,"t62i8","t62","Manufacture of Chemicals","i8","Energy Consumption","ü","",""]
[null,null,"t62i9","t62","Manufacture of Chemicals","i9","Solid Waste","ü","ü","","ü"]
[null,null,"t62i10","t62","Manufacture of Chemicals","i10","Community and Social Risks","","",null,"ü"]
[null,null,"t62i11","t62","Manufacture of Chemicals","i11","Labour Rights",null,"","ü","ü"]
[null,null,"t63i1","t63","Paper Packaging and Packaging Products","i1","Occupational Health and Safety ",null,"ü","ü",""]
[null,null,"t63i2","t63","Paper Packaging and Packaging Products","i2","Water management and wastewater","ü","ü","","ü"]
[null,null,"t63i3","t63","Paper Packaging and Packaging Products","i3","Hazardous Materials","ü","ü",null,""]
[null,null,"t63i4","t63","Paper Packaging and Packaging Products","i4","Solid Waste","ü","","","ü"]
[null,null,"t63i5","t63","Paper Packaging and Packaging Products","i5","Soil and Surface Water Contamination","ü","ü","","ü"]
[null,null,"t63i6","t63","Paper Packaging and Packaging Products","i6","Labour Rights",null,"","ü","ü"]
[null,null,"t63i7","t63","Paper Packaging and Packaging Products","i7","Fire/Explosion risk","ü","ü","","ü"]
[null,null,"t63i8","t63","Paper Packaging and Packaging Products","i8","Energy Consumption","ü","",""]
[null,null,"t63i9","t63","Paper Packaging and Packaging Products","i9","Air Emissions","ü","ü"]
[null,null,"t63i10","t63","Paper Packaging and Packaging Products","i10","Distribution and Transport","ü",null,"","ü"]
[null,null,"t63i11","t63","Paper Packaging and Packaging Products","i11","Community and Social Risks","","",null,"ü"]
[null,null,"t64i1","t64","Manufacture of Fur Products (Including Hunting and Trapping)","i1","Threats to/from biodiversity","ü","","",""]
[null,null,"t64i2","t64","Manufacture of Fur Products (Including Hunting and Trapping)","i2","Occupational Health and Safety ",null,"ü","ü",""]
[null,null,"t64i3","t64","Manufacture of Fur Products (Including Hunting and Trapping)","i3","Solid Waste","ü","","","ü"]
[null,null,"t64i4","t64","Manufacture of Fur Products (Including Hunting and Trapping)","i4","Water management and wastewater","ü","","",""]
[null,null,"t64i5","t64","Manufacture of Fur Products (Including Hunting and Trapping)","i5","Hazardous Materials","ü","ü",null,""]
[null,null,"t64i6","t64","Manufacture of Fur Products (Including Hunting and Trapping)","i6","Energy Consumption","ü","",""]
[null,null,"t64i7","t64","Manufacture of Fur Products (Including Hunting and Trapping)","i7","Violence and security issues","","ü","ü","ü"]
[null,null,"t65i1","t65","Construction of Real Estate Developments","i1","Occupational Health and Safety ",null,"ü","ü",""]
[null,null,"t65i2","t65","Construction of Real Estate Developments","i2","Community and Social Risks","","",null,"ü"]
[null,null,"t65i3","t65","Construction of Real Estate Developments","i3","Labour Rights",null,"","ü",""]
[null,null,"t65i4","t65","Construction of Real Estate Developments","i4","Air Emissions","ü","ü",null,"ü"]
[null,null,"t65i5","t65","Construction of Real Estate Developments","i5","Soil Erosion","ü"]
[null,null,"t65i6","t65","Construction of Real Estate Developments","i6","Solid Waste","ü","ü",""]
[null,null,"t65i7","t65","Construction of Real Estate Developments","i7","Climate Change","ü",null,""]
[null,null,"t65i8","t65","Construction of Real Estate Developments","i8","Hazardous Materials","ü","ü","",""]
[null,null,"t65i9","t65","Construction of Real Estate Developments","i9","Water management and wastewater","ü","","","ü"]
[null,null,"t65i10","t65","Construction of Real Estate Developments","i10","Biodiversity and habitat loss","ü",null,"",""]
[null,null,"t66i1","t66","Manufacture of Soap and Detergents","i1","Air Emissions","ü","ü",null,"ü"]
[null,null,"t66i2","t66","Manufacture of Soap and Detergents","i2","Hazardous Materials","ü","ü",null,"ü"]
[null,null,"t66i3","t66","Manufacture of Soap and Detergents","i3","Water management and wastewater","ü","","","ü"]
[null,null,"t66i4","t66","Manufacture of Soap and Detergents","i4","Solid Waste","ü","ü","",""]
[null,null,"t66i5","t66","Manufacture of Soap and Detergents","i5","Energy Consumption","ü","",""]
[null,null,"t66i6","t66","Manufacture of Soap and Detergents","i6","Occupational Health and Safety ",null,"ü","ü",""]
[null,null,"t66i7","t66","Manufacture of Soap and Detergents","i7","Labour Rights",null,"","ü",""]
[null,null,"t66i8","t66","Manufacture of Soap and Detergents","i8","Deforestation","ü"]
[null,null,"t67i1","t67","Manufacture of Plastics and Synthetics","i1","Air Emissions","ü","ü",null,"ü"]
[null,null,"t67i2","t67","Manufacture of Plastics and Synthetics","i2","Hazardous Materials","ü","ü",null,"ü"]
[null,null,"t67i3","t67","Manufacture of Plastics and Synthetics","i3","Fire/Explosion risk","ü","ü","","ü"]
[null,null,"t67i4","t67","Manufacture of Plastics and Synthetics","i4","Water management and wastewater","ü","","","ü"]
[null,null,"t67i5","t67","Manufacture of Plastics and Synthetics","i5","Solid Waste","ü","","","ü"]
[null,null,"t67i6","t67","Manufacture of Plastics and Synthetics","i6","Energy Consumption","ü","",""]
[null,null,"t67i7","t67","Manufacture of Plastics and Synthetics","i7","Occupational Health and Safety ",null,"ü","ü",""]
[null,null,"t68i1","t68","Manufacture, storage and distribution of chemicals","i1","Air Emissions","ü","ü",null,"ü"]
[null,null,"t68i2","t68","Manufacture, storage and distribution of chemicals","i2","Hazardous Materials","ü","ü","ü","ü"]
[null,null,"t68i3","t68","Manufacture, storage and distribution of chemicals","i3","Energy Consumption","ü","",""]
[null,null,"t68i4","t68","Manufacture, storage and distribution of chemicals","i4","Water management and wastewater","ü","","",""]
[null,null,"t68i5","t68","Manufacture, storage and distribution of chemicals","i5","Solid Waste","ü","","",""]
[null,null,"t68i6","t68","Manufacture, storage and distribution of chemicals","i6","Occupational Health and Safety ",null,"ü","ü",""]
[null,null,{"$f":"D573&F573","v":"t68i7"},"t68","Manufacture, storage and distribution of chemicals","i7","Distribution and Transport","ü","ü","","ü"]
[null,null,"t68i8","t68","Manufacture, storage and distribution of chemicals","i8","Labour Rights",null,"","ü",""]
[null,null,"t69i1","t69","Manufacture of Textiles","i1","Labour Rights",null,"","ü","ü"]
[null,null,"t69i2","t69","Manufacture of Textiles","i2","Water Consumption","ü",null,null,"ü"]
[null,null,"t69i3","t69","Manufacture of Textiles","i3","Air Emissions","ü","ü",null,"ü"]
[null,null,"t69i4","t69","Manufacture of Textiles","i4","Soil and Surface Water Contamination","ü","ü","","ü"]
[null,null,"t69i5","t69","Manufacture of Textiles","i5","Energy Consumption","ü","",""]
[null,null,"t69i6","t69","Manufacture of Textiles","i6","Water management and wastewater","ü","",""]
[null,null,"t69i7","t69","Manufacture of Textiles","i7","Hazardous Materials","ü","ü",null,"ü"]
[null,null,"t69i8","t69","Manufacture of Textiles","i8","Solid Waste","ü","","",""]
[null,null,"t69i9","t69","Manufacture of Textiles","i9","Occupational Health and Safety ",null,"ü","ü",""]
[null,null,"t69i10","t69","Manufacture of Textiles","i10","Community Health and Safety",null,null,null,"ü"]
[null,null,"t70i1","t70","Base metal Smelting and Refining","i1","Air Emissions","ü","ü","ü","ü"]
[null,null,"t70i2","t70","Base metal Smelting and Refining","i2","Soil and Surface Water Contamination","ü","ü",""]
[null,null,"t70i3","t70","Base metal Smelting and Refining","i3","Energy Consumption","ü","",""]
[null,null,"t70i4","t70","Base metal Smelting and Refining","i4","Water management and wastewater","ü","","","ü"]
[null,null,"t70i5","t70","Base metal Smelting and Refining","i5","Hazardous Materials","ü","ü",null,""]
[null,null,"t70i6","t70","Base metal Smelting and Refining","i6","Solid Waste","ü","","",""]
[null,null,"t70i7","t70","Base metal Smelting and Refining","i7","Occupational Health and Safety ",null,"ü","ü",""]
[null,null,"t70i8","t70","Base metal Smelting and Refining","i8","Distribution and Transport",null,null,"","ü"]
[null,null,"t70i9","t70","Base metal Smelting and Refining","i9","Personal Wellbeing",null,null,"ü","ü"]
[null,null,"t71i1","t71","Metal Fabrication","i1","Air Emissions","ü","ü",null,"ü"]
[null,null,"t71i2","t71","Metal Fabrication","i2","Soil and Surface Water Contamination","ü","ü","","ü"]
[null,null,"t71i3","t71","Metal Fabrication","i3","Energy Consumption","ü","",""]
[null,null,"t71i4","t71","Metal Fabrication","i4","Water management and wastewater","ü","","","ü"]
[null,null,"t71i5","t71","Metal Fabrication","i5","Hazardous Materials","ü","ü",null,"ü"]
[null,null,"t71i6","t71","Metal Fabrication","i6","Solid Waste","ü","","",""]
[null,null,"t71i7","t71","Metal Fabrication","i7","Occupational Health and Safety ",null,"ü","ü",""]
[null,null,"t72i1","t72","Metal Coatings","i1","Hazardous Materials","ü","ü",null,"ü"]
[null,null,"t72i2","t72","Metal Coatings","i2","Water management and wastewater","ü","","","ü"]
[null,null,"t72i3","t72","Metal Coatings","i3","Air Emissions","ü","ü",null,"ü"]
[null,null,"t72i4","t72","Metal Coatings","i4","Solid Waste","ü","","","ü"]
[null,null,"t72i5","t72","Metal Coatings","i5","Energy Consumption","ü","",""]
[null,null,"t72i6","t72","Metal Coatings","i6","Occupational Health and Safety ",null,"ü","ü",""]
[null,null,"t73i1","t73","Pharmaceuticals and Biotechnology","i1","Air Emissions","ü","ü",null,"ü"]
[null,null,"t73i2","t73","Pharmaceuticals and Biotechnology","i2","Water management and wastewater","ü","","",""]
[null,null,"t73i3","t73","Pharmaceuticals and Biotechnology","i3","Solid Waste","ü","ü","","ü"]
[null,null,"t73i4","t73","Pharmaceuticals and Biotechnology","i4","Hazardous Materials","ü","ü","ü","ü"]
[null,null,"t73i5","t73","Pharmaceuticals and Biotechnology","i5","Biosafety","ü","ü","","ü"]
[null,null,"t73i6","t73","Pharmaceuticals and Biotechnology","i6","Bioethics","ü",""]
[null,null,"t73i7","t73","Pharmaceuticals and Biotechnology","i7","Threats to/from biodiversity","ü","","",""]
[null,null,"t73i8","t73","Pharmaceuticals and Biotechnology","i8","Energy Consumption","ü","",""]
[null,null,"t73i9","t73","Pharmaceuticals and Biotechnology","i9","Occupational Health and Safety ",null,"ü","ü",""]
[null,null,"t73i10","t73","Pharmaceuticals and Biotechnology","i10","Labour Rights",null,"","ü",""]
[null,null,"t74i1","t74","Petroleum Refineries","i1","Energy Consumption","ü","",""]
[null,null,"t74i2","t74","Petroleum Refineries","i2","Air Emissions","ü","ü",null,"ü"]
[null,null,"t74i3","t74","Petroleum Refineries","i3","Hazardous Materials","ü","ü",null,"ü"]
[null,null,"t74i4","t74","Petroleum Refineries","i4","Water Consumption","ü"]
[null,null,"t74i5","t74","Petroleum Refineries","i5","Water management and wastewater","ü","ü","","ü"]
[null,null,"t74i6","t74","Petroleum Refineries","i6","Solid Waste","ü","ü","",""]
[null,null,"t74i7","t74","Petroleum Refineries","i7","Occupational Health and Safety ",null,"ü","ü",""]
[null,null,"t75i1","t75","Petrol/Gasoline Retailing","i1","Nuissance",null,"ü","ü","ü"]
[null,null,"t75i2","t75","Petrol/Gasoline Retailing","i2","Fire/Explosion risk",null,"ü","","ü"]
[null,null,"t75i3","t75","Petrol/Gasoline Retailing","i3","Air Emissions","ü",null,null,"ü"]
[null,null,"t75i4","t75","Petrol/Gasoline Retailing","i4","Alternative Fuels","ü",""]
[null,null,"t75i5","t75","Petrol/Gasoline Retailing","i5","Soil and Surface Water Contamination","ü","ü","","ü"]
[null,null,"t75i6","t75","Petrol/Gasoline Retailing","i6","Water management and wastewater","ü","","",""]
[null,null,"t75i7","t75","Petrol/Gasoline Retailing","i7","Solid Waste","ü","","",""]
[null,null,"t75i8","t75","Petrol/Gasoline Retailing","i8","Hazardous Materials","ü","ü",null,""]
[null,null,"t75i9","t75","Petrol/Gasoline Retailing","i9","Violence and security issues","","ü","ü",""]
[null,null,"t76i1","t76","Tanneries & Leather Products","i1","Water management and wastewater","ü","","","ü"]
[null,null,"t76i2","t76","Tanneries & Leather Products","i2","Hazardous Materials","ü","ü",null,"ü"]
[null,null,"t76i3","t76","Tanneries & Leather Products","i3","Labour Rights",null,"","ü","ü"]
[null,null,"t76i4","t76","Tanneries & Leather Products","i4","Air Emissions","ü","ü",null,"ü"]
[null,null,{"$f":"D637&F637","v":"t76i5"},"t76","Tanneries & Leather Products","i5","Solid Waste","ü","","","ü"]
[null,null,"t76i6","t76","Tanneries & Leather Products","i6","Occupational Health and Safety ",null,"ü","ü",""]
[null,null,"t76i7","t76","Tanneries & Leather Products","i7","Energy Consumption","ü","",""]
[null,null,"t77i1","t77","Manufacture of Rubber Products","i1","Water management and wastewater","ü","","","ü"]
[null,null,"t77i2","t77","Manufacture of Rubber Products","i2","Hazardous Materials","ü","ü",null,"ü"]
[null,null,"t77i3","t77","Manufacture of Rubber Products","i3","Fire/Explosion risk","ü","ü","",""]
[null,null,"t77i4","t77","Manufacture of Rubber Products","i4","Solid Waste","ü","ü","","ü"]
[null,null,"t77i5","t77","Manufacture of Rubber Products","i5","Air Emissions","ü","ü",null,"ü"]
[null,null,"t77i6","t77","Manufacture of Rubber Products","i6","Energy Consumption","ü","",""]
[null,null,"t77i7","t77","Manufacture of Rubber Products","i7","Occupational Health and Safety ",null,"ü","ü",""]
[null,null,"t78i1","t78","Pulp and Paper","i1","Supply Chain Risk","ü","ü","ü","ü"]
[null,null,"t78i2","t78","Pulp and Paper","i2","Fire/Explosion risk","ü","ü","","ü"]
[null,null,"t78i3","t78","Pulp and Paper","i3","Hazardous Materials","ü","ü",null,"ü"]
[null,null,"t78i4","t78","Pulp and Paper","i4","Air Emissions","ü","ü",null,"ü"]
[null,null,"t78i5","t78","Pulp and Paper","i5","Water management and wastewater","ü","","","ü"]
[null,null,"t78i6","t78","Pulp and Paper","i6","Solid Waste","ü","","",""]
[null,null,"t78i7","t78","Pulp and Paper","i7","Occupational Health and Safety ",null,"ü","ü",""]
[null,null,"t78i8","t78","Pulp and Paper","i8","Energy Consumption","ü","",""]
[null,null,"t79i1","t79","Agrochemicals Production","i1","Air Emissions","ü","ü",null,"ü"]
[null,null,"t79i2","t79","Agrochemicals Production","i2","Hazardous Materials","ü","ü",null,"ü"]
[null,null,"t79i3","t79","Agrochemicals Production","i3","Water management and wastewater","ü","","","ü"]
[null,null,"t79i4","t79","Agrochemicals Production","i4","Solid Waste","ü","ü","","ü"]
[null,null,"t79i5","t79","Agrochemicals Production","i5","Energy Consumption","ü","",""]
[null,null,"t79i6","t79","Agrochemicals Production","i6","Occupational Health and Safety ",null,"ü","ü",""]
[null,null,"t79i7","t79","Agrochemicals Production","i7","Labour Rights",null,"","ü",""]
[null,null,"t80i1","t80","Ferrous Metal Processing","i1","Air Emissions","ü","ü","ü","ü"]
[null,null,"t80i2","t80","Ferrous Metal Processing","i2","Soil and Surface Water Contamination","ü","ü","","ü"]
[null,null,"t80i3","t80","Ferrous Metal Processing","i3","Energy Consumption","ü","",""]
[null,null,"t80i4","t80","Ferrous Metal Processing","i4","Water management and wastewater","ü","","","ü"]
[null,null,"t80i5","t80","Ferrous Metal Processing","i5","Hazardous Materials","ü","ü",null,""]
[null,null,"t80i6","t80","Ferrous Metal Processing","i6","Solid Waste","ü","","",""]
[null,null,"t80i7","t80","Ferrous Metal Processing","i7","Occupational Health and Safety ",null,"ü","ü",""]
[null,null,"t81i1","t81","Construction of Major Civil Engineering Projects","i1","Community and Social Risks","","",null,"ü"]
[null,null,"t81i2","t81","Construction of Major Civil Engineering Projects","i2","Occupational Health and Safety ",null,"ü","ü",""]
[null,null,"t81i3","t81","Construction of Major Civil Engineering Projects","i3","Labour Rights",null,"","ü",""]
[null,null,"t81i4","t81","Construction of Major Civil Engineering Projects","i4","Threats to/from biodiversity","ü","","",""]
[null,null,"t81i5","t81","Construction of Major Civil Engineering Projects","i5","Cultural Heritage",null,null,null,"ü"]
[null,null,"t81i6","t81","Construction of Major Civil Engineering Projects","i6","Air Emissions","ü","ü",null,"ü"]
[null,null,"t81i7","t81","Construction of Major Civil Engineering Projects","i7","Soil Erosion","ü"]
[null,null,"t81i8","t81","Construction of Major Civil Engineering Projects","i8","Solid Waste","ü","ü","",""]
[null,null,"t81i9","t81","Construction of Major Civil Engineering Projects","i9","Climate Change","ü"]
[null,null,"t81i10","t81","Construction of Major Civil Engineering Projects","i10","Hazardous Materials","ü","ü",null,"ü"]
[null,null,"t81i11","t81","Construction of Major Civil Engineering Projects","i11","Water management and wastewater","ü","","","ü"]
[null,null,"t82i1","t82","Manufacture of Petroleum and Coal Products","i1","Air Emissions","ü","ü",null,"ü"]
[null,null,"t82i2","t82","Manufacture of Petroleum and Coal Products","i2","Soil and Surface Water Contamination","ü","ü","","ü"]
[null,null,"t82i3","t82","Manufacture of Petroleum and Coal Products","i3","Hazardous Materials","ü","ü",null,"ü"]
[null,null,"t82i4","t82","Manufacture of Petroleum and Coal Products","i4","Energy Consumption","ü","",""]
[null,null,"t82i5","t82","Manufacture of Petroleum and Coal Products","i5","Water management and wastewater","ü","","","ü"]
[null,null,"t82i6","t82","Manufacture of Petroleum and Coal Products","i6","Solid Waste","ü","ü","",""]
[null,null,"t82i7","t82","Manufacture of Petroleum and Coal Products","i7","Occupational Health and Safety ",null,"ü","ü",""]
[null,null,"t82i8","t82","Manufacture of Petroleum and Coal Products","i8","Community and Social Risks","","",null,"ü"]
[null,null,"t83i1","t83","Manufacture of Paints and Related Products","i1","Air Emissions","ü","ü",null,"ü"]
[null,null,"t83i2","t83","Manufacture of Paints and Related Products","i2","Hazardous Materials","ü","ü",null,"ü"]
[null,null,"t83i3","t83","Manufacture of Paints and Related Products","i3","Water management and wastewater","ü","","","ü"]
[null,null,"t83i4","t83","Manufacture of Paints and Related Products","i4","Solid Waste","ü","ü","","ü"]
[null,null,"t83i5","t83","Manufacture of Paints and Related Products","i5","Energy Consumption","ü","",""]
[null,null,"t83i6","t83","Manufacture of Paints and Related Products","i6","Occupational Health and Safety ",null,"ü","ü",""]
[null,null,"t83i7","t83","Manufacture of Paints and Related Products","i7","Labour Rights",null,"","ü",""]
[null,null,"t84i1","t84","Manufacture of Footwear and Apparel","i1","Labour Rights",null,"","ü","ü"]
[null,null,"t84i2","t84","Manufacture of Footwear and Apparel","i2","Air Emissions","ü","ü",null,"ü"]
[null,null,"t84i3","t84","Manufacture of Footwear and Apparel","i3","Hazardous Materials","ü","ü",null,"ü"]
[null,null,"t84i4","t84","Manufacture of Footwear and Apparel","i4","Energy Consumption","ü","",""]
[null,null,"t84i5","t84","Manufacture of Footwear and Apparel","i5","Water management and wastewater","ü","","",""]
[null,null,"t84i6","t84","Manufacture of Footwear and Apparel","i6","Soil and Surface Water Contamination","ü","ü","","ü"]
[null,null,{"$f":"D701&F701","v":"t84i7"},"t84","Manufacture of Footwear and Apparel","i7","Solid Waste","ü","","",""]
[null,null,"t84i8","t84","Manufacture of Footwear and Apparel","i8","Occupational Health and Safety ",null,"ü","ü",""]
[null,null,"t84i9","t84","Manufacture of Footwear and Apparel","i9","Community and Social Risks","","",null,"ü"]
[null,null,"t85i1","t85","Manufacture of Furniture and Fittings","i1","Supply Chain Risk","ü","ü","ü","ü"]
[null,null,"t85i2","t85","Manufacture of Furniture and Fittings","i2","Hazardous Materials","ü","ü",null,"ü"]
[null,null,"t85i3","t85","Manufacture of Furniture and Fittings","i3","Occupational Health and Safety ",null,"ü","ü",""]
[null,null,"t85i4","t85","Manufacture of Furniture and Fittings","i4","Air Emissions","ü","ü",null,"ü"]
[null,null,"t85i5","t85","Manufacture of Furniture and Fittings","i5","Water management and wastewater","ü","","","ü"]
[null,null,"t85i6","t85","Manufacture of Furniture and Fittings","i6","Solid Waste","ü","","","ü"]
[null,null,"t85i7","t85","Manufacture of Furniture and Fittings","i7","Labour Rights",null,"","ü",""]
[null,null,"t86i1","t86","Wood Processing","i1","Supply Chain Risk","ü","ü","ü","ü"]
[null,null,"t86i2","t86","Wood Processing","i2","Hazardous Materials","ü","ü",null,"ü"]
[null,null,"t86i3","t86","Wood Processing","i3","Occupational Health and Safety ",null,"ü","ü",""]
[null,null,"t86i4","t86","Wood Processing","i4","Air Emissions","ü","ü",null,"ü"]
[null,null,"t86i5","t86","Wood Processing","i5","Water management and wastewater","ü","","","ü"]
[null,null,"t86i6","t86","Wood Processing","i6","Solid Waste","ü","","","ü"]
[null,null,"t86i7","t86","Wood Processing","i7","Energy Consumption","ü","",""]
[null,null,"t86i8","t86","Wood Processing","i8","Labour Rights",null,"","ü","ü"]
[null,null,"t86i9","t86","Wood Processing","i9","Community and Social Risks","","",null,"ü"]
[null,null,"t87i1","t87","Supermarkets","i1","Energy Consumption","ü","",""]
[null,null,"t87i2","t87","Supermarkets","i2","Solid Waste","ü","","","ü"]
[null,null,"t87i3","t87","Supermarkets","i3","Air Emissions","ü",null,null,"ü"]
[null,null,"t87i4","t87","Supermarkets","i4","Food Safety",null,null,null,"ü"]
[null,null,"t87i5","t87","Supermarkets","i5","Occupational Health and Safety ",null,"ü","ü",""]
[null,null,"t87i6","t87","Supermarkets","i6","Water management and wastewater","ü","","","ü"]
[null,null,"t87i7","t87","Supermarkets","i7","Supply Chain Risk",null,null,null,"ü"]
[null,null,"t87i8","t87","Supermarkets","i8","Community and Social Risks","","",null,"ü"]
[null,null,"t88i1","t88","Motor Vehicle Assembly","i1","Air Emissions","ü","ü",null,"ü"]
[null,null,"t88i2","t88","Motor Vehicle Assembly","i2","Hazardous Materials","ü","ü",null,"ü"]
[null,null,"t88i3","t88","Motor Vehicle Assembly","i3","Water management and wastewater","ü","","","ü"]
[null,null,"t88i4","t88","Motor Vehicle Assembly","i4","Solid Waste","ü","","","ü"]
[null,null,"t88i5","t88","Motor Vehicle Assembly","i5","Energy Consumption","ü","",""]
[null,null,"t88i6","t88","Motor Vehicle Assembly","i6","Occupational Health and Safety ",null,"ü","ü",""]
[null,null,"t88i7","t88","Motor Vehicle Assembly","i7","Labour Rights",null,"","ü","ü"]
[null,null,"t89i1","t89","Vehicle Repair Services and Parking","i1","Air Emissions","ü","ü",null,"ü"]
[null,null,"t89i2","t89","Vehicle Repair Services and Parking","i2","Hazardous Materials","ü","ü",null,"ü"]
[null,null,"t89i3","t89","Vehicle Repair Services and Parking","i3","Fire/Explosion risk","ü","ü",null,"ü"]
[null,null,"t89i4","t89","Vehicle Repair Services and Parking","i4","Solid Waste","ü",null,null,"ü"]
[null,null,"t89i5","t89","Vehicle Repair Services and Parking","i5","Water management and wastewater","ü",null,null,"ü"]
[null,null,"t89i6","t89","Vehicle Repair Services and Parking","i6","Occupational Health and Safety ",null,"ü","ü"]
[null,null,"t89i7","t89","Vehicle Repair Services and Parking","i7","Labour Rights",null,null,"ü","ü"]
[null,null,"t89i8","t89","Vehicle Repair Services and Parking","i8","Ethics and Bribery",null,null,"ü","ü"]
[null,null,"t89i9","t89","Vehicle Repair Services and Parking","i9","Community and Social Risks",null,null,null,"ü"]
[null,null,"t90i1","t90","Printing and Publishing","i1","Supply Chain Risk","ü",null,"ü","ü"]
[null,null,"t90i2","t90","Printing and Publishing","i2","Air Emissions","ü","ü",null,"ü"]
[null,null,"t90i3","t90","Printing and Publishing","i3","Hazardous Materials","ü","ü",null,"ü"]
[null,null,"t90i4","t90","Printing and Publishing","i4","Occupational Health and Safety ",null,"ü","ü"]
[null,null,"t90i5","t90","Printing and Publishing","i5","Water management and wastewater","ü",null,null,"ü"]
[null,null,"t90i6","t90","Printing and Publishing","i6","Solid Waste","ü",null,null,"ü"]
[null,null,"t90i7","t90","Printing and Publishing","i7","Labour Rights",null,null,"ü","ü"]
[null,null,"t90i8","t90","Printing and Publishing","i8","Energy Consumption","ü"]
[null,null,"t90i9","t90","Printing and Publishing","i9","Ethics and Bribery",null,null,"ü","ü"]
[null,null,"t90i10","t90","Printing and Publishing","i10","Community and Social Risks",null,null,null,"ü"]
[null,null,"t91i1","t91","Extraction of Peat","i1","Threats to/from biodiversity","ü",null,null,"ü"]
[null,null,"t91i2","t91","Extraction of Peat","i2","Climate Change","ü",null,null,"ü"]
[null,null,"t91i3","t91","Extraction of Peat","i3","Effects on drainage","ü"]
[null,null,"t91i4","t91","Extraction of Peat","i4","Soil Erosion","ü",null,null,"ü"]
[null,null,"t91i5","t91","Extraction of Peat","i5","Storage of Fuels and Oils","ü","ü","ü"]
[null,null,"t91i6","t91","Extraction of Peat","i6","Solid Waste","ü"]
[null,null,"t91i7","t91","Extraction of Peat","i7","Fire/Explosion risk","ü","ü","ü","ü"]
[null,null,"t91i8","t91","Extraction of Peat","i8","Moving Plant and Equipment",null,"ü","ü"]
[null,null,"t91i9","t91","Extraction of Peat","i9","Lifting and Carrying",null,"ü","ü"]
[null,null,"t91i10","t91","Extraction of Peat","i10","Nuissance","ü","ü","ü","ü"]
[null,null,"t91i11","t91","Extraction of Peat","i11","Risk of accidents",null,null,null,"ü"]
[null,null,{"$f":"D765&F765","v":"t91i12"},"t91","Extraction of Peat","i12","Relations with Neighbours",null,null,null,"ü"]
[null,null,"t91i13","t91","Extraction of Peat","i13","Peatland Restoration","ü"]
[null,null,"t92i1","t92","Manufacture of Non-Alcoholic Beverages","i1","Water Supply","ü","ü",null,"ü"]
[null,null,"t92i2","t92","Manufacture of Non-Alcoholic Beverages","i2","Water management and wastewater","ü",null,null,"ü"]
[null,null,"t92i3","t92","Manufacture of Non-Alcoholic Beverages","i3","Energy Consumption","ü"]
[null,null,"t92i4","t92","Manufacture of Non-Alcoholic Beverages","i4","Refrigerants","ü","ü",null,"ü"]
[null,null,"t92i5","t92","Manufacture of Non-Alcoholic Beverages","i5","Hazardous Materials","ü","ü"]
[null,null,"t92i6","t92","Manufacture of Non-Alcoholic Beverages","i6","Solid Waste","ü","ü",null,"ü"]
[null,null,"t92i7","t92","Manufacture of Non-Alcoholic Beverages","i7","Moving Plant and Equipment",null,"ü","ü"]
[null,null,"t92i8","t92","Manufacture of Non-Alcoholic Beverages","i8","Manual Handling, Slips, Trips and Falls",null,"ü","ü"]
[null,null,"t92i9","t92","Manufacture of Non-Alcoholic Beverages","i9","Nuissance",null,"ü","ü","ü"]
[null,null,"t92i10","t92","Manufacture of Non-Alcoholic Beverages","i10","CO2 and Asphyxation",null,"ü","ü"]
[null,null,"t92i11","t92","Manufacture of Non-Alcoholic Beverages","i11","Temperature and/or Radiation Exposure",null,"ü","ü"]
[null,null,"t92i12","t92","Manufacture of Non-Alcoholic Beverages","i12","Odour",null,"ü","ü"]
[null,null,"t92i13","t92","Manufacture of Non-Alcoholic Beverages","i13","Hygiene","ü","ü","ü"]
[null,null,"t92i14","t92","Manufacture of Non-Alcoholic Beverages","i14","Fire/Explosion risk",null,"ü","ü","ü"]
[null,null,"t92i15","t92","Manufacture of Non-Alcoholic Beverages","i15","Distribution and Transport",null,"ü",null,"ü"]
[null,null,"t93i1","t93","Processing of Bakery Products","i1","Food Safety",null,"ü",null,"ü"]
[null,null,"t93i2","t93","Processing of Bakery Products","i2","Air Emissions","ü","ü","ü","ü"]
[null,null,"t93i3","t93","Processing of Bakery Products","i3","Nuissance",null,"ü","ü","ü"]
[null,null,"t93i4","t93","Processing of Bakery Products","i4","Energy Consumption","ü",null,null,"ü"]
[null,null,"t93i5","t93","Processing of Bakery Products","i5","Hazardous Materials","ü",null,null,"ü"]
[null,null,"t93i6","t93","Processing of Bakery Products","i6","Solid Waste","ü","ü",null,"ü"]
[null,null,"t93i7","t93","Processing of Bakery Products","i7","Water Consumption","ü","ü",null,"ü"]
[null,null,"t93i8","t93","Processing of Bakery Products","i8","Water management and wastewater","ü",null,null,"ü"]
[null,null,"t93i9","t93","Processing of Bakery Products","i9","Manual Handling, Slips, Trips and Falls",null,"ü","ü"]
[null,null,"t93i10","t93","Processing of Bakery Products","i10","Vehicles & Collision Risk",null,"ü","ü"]
[null,null,"t93i11","t93","Processing of Bakery Products","i11","Polychlorinated Biphenyls and Asbestos","ü","ü",null,"ü"]
[null,null,"t93i12","t93","Processing of Bakery Products","i12","Temperature and/or Radiation Exposure",null,"ü"]
[null,null,"t93i13","t93","Processing of Bakery Products","i13","Working at Height or in Confined Spaces",null,"ü","ü"]
[null,null,"t93i14","t93","Processing of Bakery Products","i14","Sharp Edges & Use of Machinery",null,"ü","ü"]
[null,null,"t93i15","t93","Processing of Bakery Products","i15","Exposure to Ammonia","ü","ü",null,"ü"]
[null,null,"t93i16","t93","Processing of Bakery Products","i16","Odour",null,"ü",null,"ü"]
[null,null,"t93i17","t93","Processing of Bakery Products","i17","Distribution and Transport",null,null,null,"ü"]
[null,null,"t94i1","t94","Processing of Confectionery","i1","Hygiene",null,"ü",null,"ü"]
[null,null,"t94i2","t94","Processing of Confectionery","i2","Energy Consumption","ü","ü","ü","ü"]
[null,null,"t94i3","t94","Processing of Confectionery","i3","Dusts, Aerosols & Gases","ü","ü","ü","ü"]
[null,null,"t94i4","t94","Processing of Confectionery","i4","Hazardous Materials","ü","ü","ü"]
[null,null,"t94i5","t94","Processing of Confectionery","i5","Solid Waste","ü","ü",null,"ü"]
[null,null,"t94i6","t94","Processing of Confectionery","i6","Water Supply","ü",null,null,"ü"]
[null,null,"t94i7","t94","Processing of Confectionery","i7","Water management and wastewater","ü",null,"ü","ü"]
[null,null,"t94i8","t94","Processing of Confectionery","i8","Manual Handling, Slips, Trips and Falls",null,"ü","ü"]
[null,null,"t94i9","t94","Processing of Confectionery","i9","Vehicles & Collision Risk",null,"ü","ü"]
[null,null,"t94i10","t94","Processing of Confectionery","i10","Odour",null,"ü","ü","ü"]
[null,null,"t94i11","t94","Processing of Confectionery","i11","Nuissance",null,"ü","ü","ü"]
[null,null,"t94i12","t94","Processing of Confectionery","i12","Sharp Edges & Use of Machinery",null,"ü","ü"]
[null,null,"t94i13","t94","Processing of Confectionery","i13","Polychlorinated Biphenyls and Asbestos",null,"ü",null,"ü"]
[null,null,"t94i14","t94","Processing of Confectionery","i14","Distribution and Transport",null,"ü",null,"ü"]
[null,null,"t95i1","t95","Processing of Grain Products","i1","Air Emissions","ü","ü","ü","ü"]
[null,null,"t95i2","t95","Processing of Grain Products","i2","Water management and wastewater","ü",null,"ü","ü"]
[null,null,"t95i3","t95","Processing of Grain Products","i3","Materials Storage","ü","ü"]
[null,null,"t95i4","t95","Processing of Grain Products","i4","Solid Waste","ü",null,null,"ü"]
[null,null,"t95i5","t95","Processing of Grain Products","i5","Manual Handling, Slips, Trips and Falls",null,"ü","ü"]
[null,null,"t95i6","t95","Processing of Grain Products","i6","Moving Plant and Equipment",null,"ü","ü"]
[null,null,"t95i7","t95","Processing of Grain Products","i7","Nuissance","ü","ü",null,"ü"]
[null,null,"t95i8","t95","Processing of Grain Products","i8","Working at Height or in Confined Spaces",null,"ü"]
[null,null,"t95i9","t95","Processing of Grain Products","i9","Food Safety",null,null,null,"ü"]
[null,null,"t96i1","t96","Edible Oils Processing","i1","Threats to/from biodiversity","ü","ü",null,"ü"]
[null,null,"t96i2","t96","Edible Oils Processing","i2","Food Safety","ü","ü",null,"ü"]
[null,null,"t96i3","t96","Edible Oils Processing","i3","Odour","ü",null,null,"ü"]
[null,null,"t96i4","t96","Edible Oils Processing","i4","Solid Waste","ü",null,null,"ü"]
[null,null,"t96i5","t96","Edible Oils Processing","i5","Volatile Organic Compounds (VOCs)","ü","ü",null,"ü"]
[null,null,"t96i6","t96","Edible Oils Processing","i6","Hazardous Materials","ü","ü",null,"ü"]
[null,null,"t96i7","t96","Edible Oils Processing","i7","Water Supply","ü",null,null,"ü"]
[null,null,{"$f":"D829&F829","v":"t96i8"},"t96","Edible Oils Processing","i8","Water management and wastewater","ü",null,null,"ü"]
[null,null,"t96i9","t96","Edible Oils Processing","i9","Energy Consumption","ü",null,null,"ü"]
[null,null,"t96i10","t96","Edible Oils Processing","i10","Air Emissions","ü",null,null,"ü"]
[null,null,"t96i11","t96","Edible Oils Processing","i11","Nuissance","ü","ü","ü","ü"]
[null,null,"t96i12","t96","Edible Oils Processing","i12","Pesticides",null,"ü"]
[null,null,"t96i13","t96","Edible Oils Processing","i13","Organic Products & Labelling","ü",null,null,"ü"]
[null,null,"t96i14","t96","Edible Oils Processing","i14","Electrical Safety",null,null,null,"ü"]
[null,null,"t96i15","t96","Edible Oils Processing","i15","Polychlorinated Biphenyls and Asbestos","ü","ü",null,"ü"]
[null,null,"t96i16","t96","Edible Oils Processing","i16","Temperature and/or Radiation Exposure",null,"ü","ü"]
[null,null,"t96i17","t96","Edible Oils Processing","i17","Working at Height or in Confined Spaces",null,"ü","ü"]
[null,null,"t96i18","t96","Edible Oils Processing","i18","Labour Rights",null,null,"ü"]
[null,null,"t96i19","t96","Edible Oils Processing","i19","Relations with Neighbours",null,null,null,"ü"]
[null,null,"t97i1","t97","Fish Processing","i1","Odour","ü",null,null,"ü"]
[null,null,"t97i2","t97","Fish Processing","i2","Food Safety","ü","ü","ü","ü"]
[null,null,"t97i3","t97","Fish Processing","i3","Water management and wastewater","ü",null,null,"ü"]
[null,null,"t97i4","t97","Fish Processing","i4","Solid Waste","ü",null,null,"ü"]
[null,null,"t97i5","t97","Fish Processing","i5","Soil and Surface Water Contamination","ü",null,null,"ü"]
[null,null,"t97i6","t97","Fish Processing","i6","Water Supply","ü",null,null,"ü"]
[null,null,"t97i7","t97","Fish Processing","i7","Air Emissions","ü",null,null,"ü"]
[null,null,"t97i8","t97","Fish Processing","i8","Organic Products & Labelling","ü",null,null,"ü"]
[null,null,"t97i9","t97","Fish Processing","i9","Electrical Safety",null,"ü","ü","ü"]
[null,null,"t97i10","t97","Fish Processing","i10","Infections and Allergic Reactions",null,"ü","ü","ü"]
[null,null,"t97i11","t97","Fish Processing","i11","Refrigerants","ü",null,null,"ü"]
[null,null,"t97i12","t97","Fish Processing","i12","Manual Handling, Slips, Trips and Falls",null,"ü"]
[null,null,"t97i13","t97","Fish Processing","i13","Working at Height or in Confined Spaces",null,"ü"]
[null,null,"t97i14","t97","Fish Processing","i14","Nuissance","ü","ü","ü","ü"]
[null,null,"t97i15","t97","Fish Processing","i15","Temperature and/or Radiation Exposure","ü","ü","ü"]
[null,null,"t97i16","t97","Fish Processing","i16","Polychlorinated Biphenyls and Asbestos","ü","ü"]
[null,null,"t97i17","t97","Fish Processing","i17","Labour Rights",null,null,"ü"]
[null,null,"t97i18","t97","Fish Processing","i18","Relations with Neighbours",null,null,null,"ü"]
[null,null,"t98i1","t98","Fruit and Vegetable Processing","i1","Solid Waste","ü",null,null,"ü"]
[null,null,"t98i2","t98","Fruit and Vegetable Processing","i2","Food Safety","ü","ü",null,"ü"]
[null,null,"t98i3","t98","Fruit and Vegetable Processing","i3","Water Consumption","ü",null,null,"ü"]
[null,null,"t98i4","t98","Fruit and Vegetable Processing","i4","Water management and wastewater","ü",null,null,"ü"]
[null,null,"t98i5","t98","Fruit and Vegetable Processing","i5","Energy Consumption","ü",null,null,"ü"]
[null,null,"t98i6","t98","Fruit and Vegetable Processing","i6","Refrigerants","ü",null,null,"ü"]
[null,null,"t98i7","t98","Fruit and Vegetable Processing","i7","Air Emissions","ü",null,null,"ü"]
[null,null,"t98i8","t98","Fruit and Vegetable Processing","i8","Odour","ü",null,null,"ü"]
[null,null,"t98i9","t98","Fruit and Vegetable Processing","i9","Nuissance","ü","ü","ü","ü"]
[null,null,"t98i10","t98","Fruit and Vegetable Processing","i10","Hazardous Materials","ü",null,null,"ü"]
[null,null,"t98i11","t98","Fruit and Vegetable Processing","i11","Pesticides",null,"ü","ü"]
[null,null,"t98i12","t98","Fruit and Vegetable Processing","i12","Electrical Safety",null,"ü",null,"ü"]
[null,null,"t98i13","t98","Fruit and Vegetable Processing","i13","Organic Products & Labelling","ü",null,null,"ü"]
[null,null,"t98i14","t98","Fruit and Vegetable Processing","i14","Manual Handling, Slips, Trips and Falls",null,"ü"]
[null,null,"t98i15","t98","Fruit and Vegetable Processing","i15","Temperature and/or Radiation Exposure",null,"ü","ü"]
[null,null,"t98i16","t98","Fruit and Vegetable Processing","i16","Working at Height or in Confined Spaces",null,"ü"]
[null,null,"t98i17","t98","Fruit and Vegetable Processing","i17","Labour Rights",null,null,"ü"]
[null,null,"t98i18","t98","Fruit and Vegetable Processing","i18","Relations with Neighbours",null,null,null,"ü"]
[null,null,"t99i1","t99","Meat Processing","i1","Food Safety","ü","ü",null,"ü"]
[null,null,"t99i2","t99","Meat Processing","i2","Water Consumption","ü",null,null,"ü"]
[null,null,"t99i3","t99","Meat Processing","i3","Solid Waste","ü",null,null,"ü"]
[null,null,"t99i4","t99","Meat Processing","i4","Air Emissions","ü",null,null,"ü"]
[null,null,"t99i5","t99","Meat Processing","i5","Odour","ü",null,null,"ü"]
[null,null,"t99i6","t99","Meat Processing","i6","Refrigerants","ü",null,null,"ü"]
[null,null,"t99i7","t99","Meat Processing","i7","Organic Products & Labelling","ü",null,null,"ü"]
[null,null,"t99i8","t99","Meat Processing","i8","Polychlorinated Biphenyls and Asbestos","ü",null,"ü","ü"]
[null,null,"t99i9","t99","Meat Processing","i9","Electrical Safety",null,"ü","ü","ü"]
[null,null,"t99i10","t99","Meat Processing","i10","Energy Consumption","ü",null,null,"ü"]
[null,null,"t99i11","t99","Meat Processing","i11","Manual Handling, Slips, Trips and Falls",null,"ü"]
[null,null,"t99i12","t99","Meat Processing","i12","Working at Height or in Confined Spaces",null,"ü"]
[null,null,"t99i13","t99","Meat Processing","i13","Nuissance","ü","ü","ü","ü"]
[null,null,"t99i14","t99","Meat Processing","i14","Temperature and/or Radiation Exposure",null,"ü","ü"]
[null,null,"t99i15","t99","Meat Processing","i15","Labour Rights",null,null,"ü"]
[null,null,"t99i16","t99","Meat Processing","i16","Relations with Neighbours",null,null,null,"ü"]
[null,null,{"$f":"D893&F893","v":"t100i1"},"t100","Wine Making","i1","Water Consumption","ü",null,null,"ü"]
[null,null,"t100i2","t100","Wine Making","i2","Wastewater Management","ü",null,null,"ü"]
[null,null,"t100i3","t100","Wine Making","i3","Energy Consumption","ü",null,null,"ü"]
[null,null,"t100i4","t100","Wine Making","i4","Solid Waste Management","ü"]
[null,null,"t100i5","t100","Wine Making","i5","Soil and Groundwater Contamination","ü",null,null,"ü"]
[null,null,"t100i6","t100","Wine Making","i6","Refrigerants","ü",null,null,"ü"]
[null,null,"t100i7","t100","Wine Making","i7","Confined Spaces and Asphyxiation",null,"ü","ü","ü"]
[null,null,"t100i8","t100","Wine Making","i8","Machinery and Working at Height",null,"ü","ü","ü"]
[null,null,"t100i9","t100","Wine Making","i9","Caustics, acids, pressured gases ","ü","ü","ü","ü"]
[null,null,"t100i10","t100","Wine Making","i10","Slips, Trips and Falls",null,"ü","ü","ü"]
[null,null,"t100i11","t100","Wine Making","i11","Manual Handling and Repetitive Work",null,"ü","ü"]
[null,null,"t100i12","t100","Wine Making","i12","Hygiene",null,"ü","ü","ü"]
[null,null,"t100i13","t100","Wine Making","i13","Glass Bottling Operations",null,"ü","ü","ü"]
[null,null,"t100i14","t100","Wine Making","i14","Supply Chain Labour Conditions",null,null,null,"ü"]
[null,null,"t101i1","t101","Oil & Gas Extraction (Offshore)","i1","Air Emissions","ü","ü",null,"ü"]
[null,null,"t101i2","t101","Oil & Gas Extraction (Offshore)","i2","Spills","ü","ü",null,"ü"]
[null,null,"t101i3","t101","Oil & Gas Extraction (Offshore)","i3","Water management and wastewater","ü","ü",null,"ü"]
[null,null,"t101i4","t101","Oil & Gas Extraction (Offshore)","i4","Solid Waste","ü","ü",null,"ü"]
[null,null,"t101i5","t101","Oil & Gas Extraction (Offshore)","i5","Hazardous Materials","ü","ü",null,"ü"]
[null,null,"t101i6","t101","Oil & Gas Extraction (Offshore)","i6","Threats to/from biodiversity","ü"]
[null,null,"t101i7","t101","Oil & Gas Extraction (Offshore)","i7","Nuissance","ü","ü"]
[null,null,"t101i8","t101","Oil & Gas Extraction (Offshore)","i8","Fire/Explosion risk","ü","ü"]
[null,null,"t101i9","t101","Oil & Gas Extraction (Offshore)","i9","Manual Handling, Slips, Trips and Falls",null,null,"ü"]
[null,null,"t101i10","t101","Oil & Gas Extraction (Offshore)","i10","Worker Accomodation",null,null,"ü"]
[null,null,"t101i11","t101","Oil & Gas Extraction (Offshore)","i11","Remote Site Health",null,null,"ü"]
[null,null,"t101i12","t101","Oil & Gas Extraction (Offshore)","i12","Workforce Transfer",null,null,"ü"]
[null,null,"t101i13","t101","Oil & Gas Extraction (Offshore)","i13","Fishing","ü"]
[null,null,"t101i14","t101","Oil & Gas Extraction (Offshore)","i14","Vehicles & Collision Risk",null,"ü",null,"ü"]
[null,null,"t101i15","t101","Oil & Gas Extraction (Offshore)","i15","Emergency Preparedness and Response",null,"ü",null,"ü"]
[null,null,"t101i16","t101","Oil & Gas Extraction (Offshore)","i16","Decomissioning","ü",null,null,"ü"]
[null,null,"t102i1","t102","Oil & Gas Extraction (Onshore)","i1","Air Emissions","ü","ü",null,"ü"]
[null,null,"t102i2","t102","Oil & Gas Extraction (Onshore)","i2","Water Consumption","ü",null,null,"ü"]
[null,null,"t102i3","t102","Oil & Gas Extraction (Onshore)","i3","Soil and Surface Water Contamination","ü",null,null,"ü"]
[null,null,"t102i4","t102","Oil & Gas Extraction (Onshore)","i4","Water management and wastewater","ü","ü",null,"ü"]
[null,null,"t102i5","t102","Oil & Gas Extraction (Onshore)","i5","Solid Waste","ü","ü",null,"ü"]
[null,null,"t102i6","t102","Oil & Gas Extraction (Onshore)","i6","Hazardous Materials","ü","ü"]
[null,null,"t102i7","t102","Oil & Gas Extraction (Onshore)","i7","Threats to/from biodiversity","ü"]
[null,null,"t102i8","t102","Oil & Gas Extraction (Onshore)","i8","Seismic Activity","ü",null,null,"ü"]
[null,null,"t102i9","t102","Oil & Gas Extraction (Onshore)","i9","Nuissance","ü","ü",null,"ü"]
[null,null,"t102i10","t102","Oil & Gas Extraction (Onshore)","i10","Fire/Explosion risk",null,"ü",null,"ü"]
[null,null,"t102i11","t102","Oil & Gas Extraction (Onshore)","i11","Well Blowouts",null,"ü",null,"ü"]
[null,null,"t102i12","t102","Oil & Gas Extraction (Onshore)","i12","Manual Handling, Slips, Trips and Falls",null,"ü","ü"]
[null,null,"t102i13","t102","Oil & Gas Extraction (Onshore)","i13","Worker Accomodation",null,null,"ü"]
[null,null,"t102i14","t102","Oil & Gas Extraction (Onshore)","i14","Remote Site Health",null,null,"ü"]
[null,null,"t102i15","t102","Oil & Gas Extraction (Onshore)","i15","Indigenous People",null,null,null,"ü"]
[null,null,"t102i16","t102","Oil & Gas Extraction (Onshore)","i16","Community Health and Safety",null,null,null,"ü"]
[null,null,"t102i17","t102","Oil & Gas Extraction (Onshore)","i17","Community and Social Risks",null,null,null,"ü"]
[null,null,"t102i18","t102","Oil & Gas Extraction (Onshore)","i18","Visual Impact",null,null,null,"ü"]
[null,null,"t102i19","t102","Oil & Gas Extraction (Onshore)","i19","Financial Dependency",null,null,null,"ü"]
[null,null,"t102i20","t102","Oil & Gas Extraction (Onshore)","i20","Traffic Management",null,null,null,"ü"]
[null,null,"t102i21","t102","Oil & Gas Extraction (Onshore)","i21","Decomissioning","ü",null,null,"ü"]
[null,null,"t103i1","t103","Petrochemical Storage and Distribution","i1","Air Emissions","ü",null,null,"ü"]
[null,null,"t103i2","t103","Petrochemical Storage and Distribution","i2","Risk of accidents","ü","ü",null,"ü"]
[null,null,"t103i3","t103","Petrochemical Storage and Distribution","i3","Water management and wastewater","ü",null,null,"ü"]
[null,null,"t103i4","t103","Petrochemical Storage and Distribution","i4","Soil and Surface Water Contamination","ü",null,null,"ü"]
[null,null,"t103i5","t103","Petrochemical Storage and Distribution","i5","Electrical Safety",null,"ü"]
[null,null,"t103i6","t103","Petrochemical Storage and Distribution","i6","Working at Height or in Confined Spaces",null,"ü"]
[null,null,"t103i7","t103","Petrochemical Storage and Distribution","i7","Hazardous Materials",null,"ü"]
[null,null,"t103i8","t103","Petrochemical Storage and Distribution","i8","Manual Handling, Slips, Trips and Falls",null,"ü"]
[null,null,"t103i9","t103","Petrochemical Storage and Distribution","i9","Relations with Neighbours",null,null,null,"ü"]
[null,null,"t103i10","t103","Petrochemical Storage and Distribution","i10","Traffic Management","ü","ü",null,"ü"]
[null,null,"t103i11","t103","Petrochemical Storage and Distribution","i11","Labour Rights",null,null,"ü"]
[null,null,"t104i1","t104","Solar Power ","i1","Land Use Change","ü",null,null,"ü"]
[null,null,"t104i2","t104","Solar Power ","i2","Threats to/from biodiversity","ü",null,null,"ü"]
[null,null,{"$f":"D957&F957","v":"t104i3"},"t104","Solar Power ","i3","Air Emissions","ü","ü",null,"ü"]
[null,null,"t104i4","t104","Solar Power ","i4","Water Consumption","ü",null,null,"ü"]
[null,null,"t104i5","t104","Solar Power ","i5","Hazardous Materials","ü","ü","ü","ü"]
[null,null,"t104i6","t104","Solar Power ","i6","Solid Waste","ü",null,null,"ü"]
[null,null,"t104i7","t104","Solar Power ","i7","Lone Working",null,"ü","ü"]
[null,null,"t104i8","t104","Solar Power ","i8","Worker Accomodation",null,"ü","ü"]
[null,null,"t104i9","t104","Solar Power ","i9","Cultural Heritage",null,null,null,"ü"]
[null,null,"t104i10","t104","Solar Power ","i10","Community and Social Risks",null,null,null,"ü"]
[null,null,"t104i11","t104","Solar Power ","i11","Visual Impact","ü","ü",null,"ü"]
[null,null,"t105i1","t105","Electricity Transmission and Distribution","i1","Visual Amenity","ü",null,null,"ü"]
[null,null,"t105i2","t105","Electricity Transmission and Distribution","i2","Threats to/from biodiversity","ü",null,null,"ü"]
[null,null,"t105i3","t105","Electricity Transmission and Distribution","i3","Electrical Safety","ü","ü","ü","ü"]
[null,null,"t105i4","t105","Electricity Transmission and Distribution","i4","Electromagnetic Fields (EMF)",null,"ü","ü","ü"]
[null,null,"t105i5","t105","Electricity Transmission and Distribution","i5","Working at Height or in Confined Spaces",null,"ü"]
[null,null,"t105i6","t105","Electricity Transmission and Distribution","i6","Hazardous Materials","ü","ü",null,"ü"]
[null,null,"t105i7","t105","Electricity Transmission and Distribution","i7","Soil and Surface Water Contamination","ü",null,null,"ü"]
[null,null,"t105i8","t105","Electricity Transmission and Distribution","i8","Relations with Neighbours",null,null,null,"ü"]
[null,null,"t105i9","t105","Electricity Transmission and Distribution","i9","Labour Rights",null,null,"ü"]
[null,null,"t105i10","t105","Electricity Transmission and Distribution","i10","Cultural Heritage","ü",null,null,"ü"]
[null,null,"t106i1","t106","Road Freight Services","i1","Air Emissions","ü","ü",null,"ü"]
[null,null,"t106i2","t106","Road Freight Services","i2","Dusts, Aerosols & Gases","ü","ü"]
[null,null,"t106i3","t106","Road Freight Services","i3","Threats to/from biodiversity","ü"]
[null,null,"t106i4","t106","Road Freight Services","i4","Effluent and Water Pollution","ü"]
[null,null,"t106i5","t106","Road Freight Services","i5","Solid Waste","ü"]
[null,null,"t106i6","t106","Road Freight Services","i6","Community Health and Safety","ü",null,null,"ü"]
[null,null,"t106i7","t106","Road Freight Services","i7","Distribution and Transport","ü","ü"]
[null,null,"t106i8","t106","Road Freight Services","i8","Livestock Transport",null,"ü",null,"ü"]
[null,null,"t106i9","t106","Road Freight Services","i9","Refrigerants","ü",null,null,"ü"]
[null,null,"t106i10","t106","Road Freight Services","i10","Fire/Explosion risk","ü","ü",null,"ü"]
[null,null,"t106i11","t106","Road Freight Services","i11","Congestion","ü",null,null,"ü"]
[null,null,"t106i12","t106","Road Freight Services","i12","Labour Rights",null,"ü","ü"]
[null,null,"t106i13","t106","Road Freight Services","i13","Manual Handling, Slips, Trips and Falls",null,"ü"]
[null,null,"t106i14","t106","Road Freight Services","i14","Traffic Management",null,null,null,"ü"]
[null,null,"t106i15","t106","Road Freight Services","i15","Driver Wellness",null,"ü",null,"ü"]
[null,null,"t106i16","t106","Road Freight Services","i16","Emergency Preparedness and Response",null,null,null,"ü"]
[null,null,"t106i17","t106","Road Freight Services","i17","Nuissance","ü","ü"]
[null,null,"t107i1","t107","Airports & Air Transportation","i1","Nuissance","ü",null,"ü","ü"]
[null,null,"t107i2","t107","Airports & Air Transportation","i2","Regional Air Quality","ü",null,null,"ü"]
[null,null,"t107i3","t107","Airports & Air Transportation","i3","Local Air Quality","ü",null,null,"ü"]
[null,null,"t107i4","t107","Airports & Air Transportation","i4","Solid Waste","ü"]
[null,null,"t107i5","t107","Airports & Air Transportation","i5","Hazardous Materials","ü",null,null,"ü"]
[null,null,"t107i6","t107","Airports & Air Transportation","i6","Occupational Health and Safety ",null,"ü","ü"]
[null,null,"t107i7","t107","Airports & Air Transportation","i7","Pulmonary Issues",null,"ü",null,"ü"]
[null,null,"t107i8","t107","Airports & Air Transportation","i8","Traffic Management",null,"ü"]
[null,null,"t107i9","t107","Airports & Air Transportation","i9","Manual Handling, Slips, Trips and Falls",null,"ü"]
[null,null,"t107i10","t107","Airports & Air Transportation","i10","Violence and security issues",null,"ü",null,"ü"]
[null,null,"t107i11","t107","Airports & Air Transportation","i11","Labour Rights",null,"ü","ü"]
[null,null,"t107i12","t107","Airports & Air Transportation","i12","Relations with Neighbours",null,null,null,"ü"]
[null,null,"t108i1","t108","Quarrying","i1","Water Supply","ü",null,null,"ü"]
[null,null,"t108i2","t108","Quarrying","i2","Water management and wastewater","ü",null,null,"ü"]
[null,null,"t108i3","t108","Quarrying","i3","Extraction from riverbeds & coastal marine areas","ü",null,null,"ü"]
[null,null,"t108i4","t108","Quarrying","i4","Solid Waste","ü",null,null,"ü"]
[null,null,"t108i5","t108","Quarrying","i5","Threats to/from biodiversity","ü",null,null,"ü"]
[null,null,"t108i6","t108","Quarrying","i6","Dusts, Aerosols & Gases","ü",null,null,"ü"]
[null,null,"t108i7","t108","Quarrying","i7","Hazardous Materials","ü","ü","ü","ü"]
[null,null,"t108i8","t108","Quarrying","i8","Permitting Requirements","ü",null,null,"ü"]
[null,null,"t108i9","t108","Quarrying","i9","Community and Social Risks",null,null,null,"ü"]
[null,null,"t108i10","t108","Quarrying","i10","Migrant Workers and Contractors",null,"ü","ü","ü"]
[null,null,"t108i11","t108","Quarrying","i11","Nuissance","ü","ü","ü","ü"]
[null,null,"t108i12","t108","Quarrying","i12","Community Health and Safety",null,null,null,"ü"]
[null,null,"t108i13","t108","Quarrying","i13","Vehicles & Collision Risk",null,"ü","ü"]
[null,null,"t108i14","t108","Quarrying","i14","Fire/Explosion risk",null,"ü","ü","ü"]
[null,null,"t108i15","t108","Quarrying","i15","Geotechnical Stability","ü","ü","ü","ü"]
[null,null,"t108i16","t108","Quarrying","i16","Worker Accomodation",null,"ü","ü"]
[null,null,{"$f":"D1021&F1021","v":"t108i17"},"t108","Quarrying","i17","Visual Impact","ü",null,null,"ü"]
[null,null,"t108i18","t108","Quarrying","i18","Remote Site Health",null,"ü","ü"]
[null,null,"t108i19","t108","Quarrying","i19","Traffic Management",null,null,null,"ü"]
[null,null,"t108i20","t108","Quarrying","i20","Quarry Closure and Rehabilitation","ü",null,null,"ü"]
[null,null,"t109i1","t109","Mineral Processing","i1","Water Supply","ü",null,null,"ü"]
[null,null,"t109i2","t109","Mineral Processing","i2","Water management and wastewater","ü",null,null,"ü"]
[null,null,"t109i3","t109","Mineral Processing","i3","Tailings","ü",null,null,"ü"]
[null,null,"t109i4","t109","Mineral Processing","i4","Acid Rock Drainage (ARD)","ü"]
[null,null,"t109i5","t109","Mineral Processing","i5","Leaching","ü"]
[null,null,"t109i6","t109","Mineral Processing","i6","Air Emissions","ü","ü",null,"ü"]
[null,null,"t109i7","t109","Mineral Processing","i7","Hazardous Materials","ü","ü",null,"ü"]
[null,null,"t109i8","t109","Mineral Processing","i8","Threats to/from biodiversity","ü",null,null,"ü"]
[null,null,"t109i9","t109","Mineral Processing","i9","Permitting Requirements","ü"]
[null,null,"t109i10","t109","Mineral Processing","i10","Energy Consumption","ü"]
[null,null,"t109i11","t109","Mineral Processing","i11","Vehicles & Collision Risk",null,"ü","ü"]
[null,null,"t109i12","t109","Mineral Processing","i12","Migrant Workers and Contractors",null,"ü","ü","ü"]
[null,null,"t109i13","t109","Mineral Processing","i13","Manual Handling, Slips, Trips and Falls",null,"ü"]
[null,null,"t109i14","t109","Mineral Processing","i14","Electrical Safety",null,"ü"]
[null,null,"t109i15","t109","Mineral Processing","i15","Nuissance","ü","ü",null,"ü"]
[null,null,"t109i16","t109","Mineral Processing","i16","Community and Social Risks",null,null,null,"ü"]
[null,null,"t109i17","t109","Mineral Processing","i17","Visual Impact","ü",null,null,"ü"]
[null,null,"t109i18","t109","Mineral Processing","i18","Worker Accomodation",null,"ü","ü"]
[null,null,"t109i19","t109","Mineral Processing","i19","Remote Site Health",null,"ü","ü"]
[null,null,"t109i20","t109","Mineral Processing","i20","Traffic Management",null,"ü",null,"ü"]
[null,null,"t109i21","t109","Mineral Processing","i21","Quarry Closure and Rehabilitation","ü",null,null,"ü"]
[null,null,"t110i1","t110","Cement Production","i1","Air Emissions","ü",null,null,"ü"]
[null,null,"t110i2","t110","Cement Production","i2","Energy Consumption","ü"]
[null,null,"t110i3","t110","Cement Production","i3","Solid Waste","ü",null,null,"ü"]
[null,null,"t110i4","t110","Cement Production","i4","Water Consumption","ü",null,null,"ü"]
[null,null,"t110i5","t110","Cement Production","i5","Water management and wastewater","ü",null,null,"ü"]
[null,null,"t110i6","t110","Cement Production","i6","Nuissance","ü",null,null,"ü"]
[null,null,"t110i7","t110","Cement Production","i7","Hazardous Materials","ü","ü",null,"ü"]
[null,null,"t110i8","t110","Cement Production","i8","Polychlorinated Biphenyls and Asbestos","ü","ü",null,"ü"]
[null,null,"t110i9","t110","Cement Production","i9","Electrical Safety",null,"ü"]
[null,null,"t110i10","t110","Cement Production","i10","Manual Handling, Slips, Trips and Falls",null,"ü"]
[null,null,"t110i11","t110","Cement Production","i11","Working at Height or in Confined Spaces",null,"ü"]
[null,null,"t110i12","t110","Cement Production","i12","Fire/Explosion risk",null,"ü",null,"ü"]
[null,null,"t110i13","t110","Cement Production","i13","Distribution and Transport",null,"ü",null,"ü"]
[null,null,"t110i14","t110","Cement Production","i14","Relations with Neighbours",null,null,null,"ü"]
[null,null,"t111i1","t111","Animal Feed Processing","i1","Waste","ü",null,null,"ü"]
[null,null,"t111i2","t111","Animal Feed Processing","i2","Water Use","ü",null,null,"ü"]
[null,null,"t111i3","t111","Animal Feed Processing","i3","Energy Use","ü"]
[null,null,"t111i4","t111","Animal Feed Processing","i4","Wastewater","ü",null,null,"ü"]
[null,null,"t111i5","t111","Animal Feed Processing","i5","Odour","ü",null,null,"ü"]
[null,null,"t111i6","t111","Animal Feed Processing","i6","Noise","ü","ü","ü","ü"]
[null,null,"t111i7","t111","Animal Feed Processing","i7","Use of GMOs","ü",null,null,"ü"]
[null,null,"t111i8","t111","Animal Feed Processing","i8","Air Emissions","ü","ü",null,"ü"]
[null,null,"t111i9","t111","Animal Feed Processing","i9","Fires and Explosions",null,"ü",null,"ü"]
[null,null,"t111i10","t111","Animal Feed Processing","i10","Manual Handling",null,"ü"]
[null,null,"t111i11","t111","Animal Feed Processing","i11","Moving Equipment and Machinery",null,"ü"]
[null,null,"t111i12","t111","Animal Feed Processing","i12","Confined Spaces",null,"ü"]
[null,null,"t111i13","t111","Animal Feed Processing","i13","Slips, Trips and Falls",null,"ü"]
[null,null,"t111i14","t111","Animal Feed Processing","i14","Hazardous Materials",null,"ü",null,"ü"]
[null,null,"t111i15","t111","Animal Feed Processing","i15","Product/Feed Hygiene","ü",null,"ü","ü"]
[null,null,"t111i16","t111","Animal Feed Processing","i16","Product Safety",null,null,null,"ü"]
[null,null,"t111i17","t111","Animal Feed Processing","i17","Traffic Management","ü",null,null,"ü"]
[null,null,"t112i1","t112","Aquaculture (Marine and Freshwater) – Onshore and Offshore","i1","Biodiversity","ü",null,null,"ü"]
[null,null,"t112i2","t112","Aquaculture (Marine and Freshwater) – Onshore and Offshore","i2","Wastewater","ü"]
[null,null,"t112i3","t112","Aquaculture (Marine and Freshwater) – Onshore and Offshore","i3","Waste","ü"]
[null,null,"t112i4","t112","Aquaculture (Marine and Freshwater) – Onshore and Offshore","i4","Land Contamination","ü"]
[null,null,"t112i5","t112","Aquaculture (Marine and Freshwater) – Onshore and Offshore","i5","Water Use","ü",null,null,"ü"]
[null,null,"t112i6","t112","Aquaculture (Marine and Freshwater) – Onshore and Offshore","i6","Water-borne Disease","ü","ü","ü"]
[null,null,"t112i7","t112","Aquaculture (Marine and Freshwater) – Onshore and Offshore","i7","Soil Erosion and Sedimentation","ü"]
[null,null,"t112i8","t112","Aquaculture (Marine and Freshwater) – Onshore and Offshore","i8","Manual Handling",null,"ü"]
[null,null,{"$f":"D1085&F1085","v":"t112i9"},"t112","Aquaculture (Marine and Freshwater) – Onshore and Offshore","i9","Electric Shock",null,"ü"]
[null,null,"t112i10","t112","Aquaculture (Marine and Freshwater) – Onshore and Offshore","i10","Drowning",null,"ü"]
[null,null,"t112i11","t112","Aquaculture (Marine and Freshwater) – Onshore and Offshore","i11","Moving Equipment/Machinery",null,"ü"]
[null,null,"t112i12","t112","Aquaculture (Marine and Freshwater) – Onshore and Offshore","i12","Confined Spaces",null,"ü"]
[null,null,"t112i13","t112","Aquaculture (Marine and Freshwater) – Onshore and Offshore","i13","Slips, Trips, and Falls",null,"ü"]
[null,null,"t112i14","t112","Aquaculture (Marine and Freshwater) – Onshore and Offshore","i14","Energy Use","ü"]
[null,null,"t112i15","t112","Aquaculture (Marine and Freshwater) – Onshore and Offshore","i15","Refrigerants","ü","ü"]
[null,null,"t112i16","t112","Aquaculture (Marine and Freshwater) – Onshore and Offshore","i16","Noise","ü","ü","ü","ü"]
[null,null,"t112i17","t112","Aquaculture (Marine and Freshwater) – Onshore and Offshore","i17","Air Emissions","ü","ü"]
[null,null,"t112i18","t112","Aquaculture (Marine and Freshwater) – Onshore and Offshore","i18","Hazardous Materials","ü","ü",null,"ü"]
[null,null,"t112i19","t112","Aquaculture (Marine and Freshwater) – Onshore and Offshore","i19","Hygiene",null,"ü",null,"ü"]
[null,null,"t112i20","t112","Aquaculture (Marine and Freshwater) – Onshore and Offshore","i20","Odour","ü",null,null,"ü"]
[null,null,"t112i21","t112","Aquaculture (Marine and Freshwater) – Onshore and Offshore","i21","Product Safety","ü","ü",null,"ü"]
[null,null,"t112i22","t112","Aquaculture (Marine and Freshwater) – Onshore and Offshore","i22","Traffic Management",null,"ü"]
[null,null,"t113i1","t113","Construction of Roads and Railways","i1","Habitat Loss and Biodiversity ","ü",null,null,"ü"]
[null,null,"t113i2","t113","Construction of Roads and Railways","i2","Groundwater and Stormwater","ü","ü",null,"ü"]
[null,null,"t113i3","t113","Construction of Roads and Railways","i3","Solid Waste","ü",null,null,"ü"]
[null,null,"t113i4","t113","Construction of Roads and Railways","i4","Air Emissions","ü","ü",null,"ü"]
[null,null,"t113i5","t113","Construction of Roads and Railways","i5","Noise and Vibration ","ü","ü",null,"ü"]
[null,null,"t113i6","t113","Construction of Roads and Railways","i6","Interaction with Existing Traffic ",null,null,null,"ü"]
[null,null,"t113i7","t113","Construction of Roads and Railways","i7","Moving Equipment and Machinery",null,null,null,"ü"]
[null,null,"t113i8","t113","Construction of Roads and Railways","i8","Working in Excavations and at Height","ü"]
[null,null,"t113i9","t113","Construction of Roads and Railways","i9","Hazardous Materials",null,"ü"]
[null,null,"t113i10","t113","Construction of Roads and Railways","i10","Temperature",null,"ü"]
[null,null,"t113i11","t113","Construction of Roads and Railways","i11","Electricity",null,"ü"]
[null,null,"t113i12","t113","Construction of Roads and Railways","i12","Site Security",null,null,null,"ü"]
[null,null,"t113i13","t113","Construction of Roads and Railways","i13","Remote Site Health",null,"ü"]
[null,null,"t113i14","t113","Construction of Roads and Railways","i14","Community Displacement and Resettlement",null,null,null,"ü"]
[null,null,"t113i15","t113","Construction of Roads and Railways","i15","Community Health and Welfare",null,null,null,"ü"]
[null,null,"t113i16","t113","Construction of Roads and Railways","i16","Migrant Workers and Contractor Management",null,null,"ü","ü"]
[null,null,"t113i17","t113","Construction of Roads and Railways","i17","Worker Accommodation",null,null,"ü"]
[null,null,"t113i18","t113","Construction of Roads and Railways","i18","Cultural Heritage",null,null,null,"ü"]
[null,null,"t113i19","t113","Construction of Roads and Railways","i19","Community Safety"]
[null,null,"t114i1","t114","Livestock Farming","i1","Industrial Emissions","ü","ü",null,"ü"]
[null,null,"t114i2","t114","Livestock Farming","i2","Contamination of Soil and Water","ü",null,null,"ü"]
[null,null,"t114i3","t114","Livestock Farming","i3","Waste (incl. storage & spreading of farm waste)","ü","ü",null,"ü"]
[null,null,"t114i4","t114","Livestock Farming","i4","Wastewater","ü",null,null,"ü"]
[null,null,"t114i5","t114","Livestock Farming","i5","Hazardous Materials","ü","ü",null,"ü"]
[null,null,"t114i6","t114","Livestock Farming","i6","Water Use","ü",null,null,"ü"]
[null,null,"t114i7","t114","Livestock Farming","i7","Animal Welfare","ü"]
[null,null,"t114i8","t114","Livestock Farming","i8","Spread of Disease and Biosecurity","ü","ü",null,"ü"]
[null,null,"t114i9","t114","Livestock Farming","i9","Pesticide Resistance and Bioaccumulation","ü","ü",null,"ü"]
[null,null,"t114i10","t114","Livestock Farming","i10","Food Safety",null,null,null,"ü"]
[null,null,"t114i11","t114","Livestock Farming","i11","Air Emissions","ü","ü",null,"ü"]
[null,null,"t114i12","t114","Livestock Farming","i12","Odour","ü","ü","ü","ü"]
[null,null,"t114i13","t114","Livestock Farming","i13","Energy Use","ü"]
[null,null,"t114i14","t114","Livestock Farming","i14","Biodiversity","ü"]
[null,null,"t114i15","t114","Livestock Farming","i15","Release of GM Organisms to the Environment","ü"]
[null,null,"t114i16","t114","Livestock Farming","i16","Lone Working",null,"ü","ü"]
[null,null,"t114i17","t114","Livestock Farming","i17","Temperature Exposure",null,"ü","ü"]
[null,null,"t114i18","t114","Livestock Farming","i18","Injuries from Livestock",null,"ü",null,"ü"]
[null,null,"t114i19","t114","Livestock Farming","i19","Traffic Management",null,"ü",null,"ü"]
[null,null,"t114i20","t114","Livestock Farming","i20","Noise","ü","ü",null,"ü"]
[null,null,"t114i21","t114","Livestock Farming","i21","Slips, Trips and Falls",null,"ü"]
[null,null,"t114i22","t114","Livestock Farming","i22","Manual Handling",null,"ü"]
[null,null,"t114i23","t114","Livestock Farming","i23","Asbestos"]
[null,null,"t114i24","t114","Livestock Farming","i24","Labour & Working Conditions",null,null,"ü"]
[null,null,"t114i25","t114","Livestock Farming","i25","Child Labour",null,null,"ü","ü"]
[null,null,"t114i26","t114","Livestock Farming","i26","Worker Accommodation",null,null,"ü"]
[null,null,"t115i1","t115","Agricultural Production - Crops","i1","Water Use","ü",null,null,"ü"]
[null,null,"t115i2","t115","Agricultural Production - Crops","i2","Contamination of Soil and Water","ü",null,null,"ü"]
[null,null,"t115i3","t115","Agricultural Production - Crops","i3","Pesticide Resistance and Bioaccumulation","ü",null,null,"ü"]
[null,null,"t115i4","t115","Agricultural Production - Crops","i4","Soil Erosion and Degradation","ü",null,null,"ü"]
[null,null,"t115i5","t115","Agricultural Production - Crops","i5","Biodiversity","ü",null,null,"ü"]
[null,null,{"$f":"D1149&F1149","v":"t115i6"},"t115","Agricultural Production - Crops","i6","Hazardous Materials","ü","ü","ü"]
[null,null,"t115i7","t115","Agricultural Production - Crops","i7","Waste","ü",null,null,"ü"]
[null,null,"t115i8","t115","Agricultural Production - Crops","i8","Release of GMOs to the Environment","ü"]
[null,null,"t115i9","t115","Agricultural Production - Crops","i9","Strike Injuries from Moving Objects",null,"ü","ü"]
[null,null,"t115i10","t115","Agricultural Production - Crops","i10","Lone Working",null,"ü","ü"]
[null,null,"t115i11","t115","Agricultural Production - Crops","i11","Manual Handling",null,"ü","ü"]
[null,null,"t115i12","t115","Agricultural Production - Crops","i12","Slips, Trips and Falls",null,"ü","ü"]
[null,null,"t115i13","t115","Agricultural Production - Crops","i13","Air Emissions","ü","ü",null,"ü"]
[null,null,"t115i14","t115","Agricultural Production - Crops","i14","Noise","ü","ü","ü","ü"]
[null,null,"t115i15","t115","Agricultural Production - Crops","i15","Asbestos",null,"ü","ü","ü"]
[null,null,"t115i16","t115","Agricultural Production - Crops","i16","Fires and Explosions",null,"ü","ü","ü"]
[null,null,"t115i17","t115","Agricultural Production - Crops","i17","Crop Contamination",null,null,null,"ü"]
[null,null,"t115i18","t115","Agricultural Production - Crops","i18","Traffic Management",null,"ü","ü","ü"]
[null,null,"t115i19","t115","Agricultural Production - Crops","i19","Archaeology ",null,null,null,"ü"]
[null,null,"t115i20","t115","Agricultural Production - Crops","i20","Community Relations",null,null,null,"ü"]
[null,null,"t115i21","t115","Agricultural Production - Crops","i21","Labour and Working Conditions",null,null,"ü"]
[null,null,"t115i22","t115","Agricultural Production - Crops","i22","Child Labour",null,null,"ü","ü"]
[null,null,"t115i23","t115","Agricultural Production - Crops","i23","Worker Accommodation",null,null,"ü"]
[null,null,"t116i1","t116","Shipbuilding and Shipyards","i1","Wastewater ","ü",null,null,"ü"]
[null,null,"t116i2","t116","Shipbuilding and Shipyards","i2","Air Emissions ","ü","ü",null,"ü"]
[null,null,"t116i3","t116","Shipbuilding and Shipyards","i3","Waste","ü",null,null,"ü"]
[null,null,"t116i4","t116","Shipbuilding and Shipyards","i4","Soil and Groundwater Contamination","ü",null,null,"ü"]
[null,null,"t116i5","t116","Shipbuilding and Shipyards","i5","Hazardous Materials","ü",null,null,"ü"]
[null,null,"t116i6","t116","Shipbuilding and Shipyards","i6","Noise","ü","ü",null,"ü"]
[null,null,"t116i7","t116","Shipbuilding and Shipyards","i7","Radiation","ü","ü"]
[null,null,"t116i8","t116","Shipbuilding and Shipyards","i8","Polychlorinated Biphenyls (PCBs)","ü","ü",null,"ü"]
[null,null,"t116i9","t116","Shipbuilding and Shipyards","i9","Asbestos","ü","ü",null,"ü"]
[null,null,"t116i10","t116","Shipbuilding and Shipyards","i10","Moving Equipment and Machinery",null,"ü"]
[null,null,"t116i11","t116","Shipbuilding and Shipyards","i11","Occupational Dermatitis",null,"ü"]
[null,null,"t116i12","t116","Shipbuilding and Shipyards","i12","Working at Height",null,"ü"]
[null,null,"t116i13","t116","Shipbuilding and Shipyards","i13","Manual Handling ",null,"ü"]
[null,null,"t116i14","t116","Shipbuilding and Shipyards","i14","Confined Spaces",null,"ü"]
[null,null,"t116i15","t116","Shipbuilding and Shipyards","i15","Slips, Trips and Falls",null,"ü",null,"ü"]
[null,null,"t116i16","t116","Shipbuilding and Shipyards","i16","Migrant Workers and Contractors ",null,null,"ü","ü"]
[null,null,"t117i1","t117","Livestock and Perishable Foods Markets","i1","Water Use","ü",null,null,"ü"]
[null,null,"t117i2","t117","Livestock and Perishable Foods Markets","i2","Wastewater","ü",null,null,"ü"]
[null,null,"t117i3","t117","Livestock and Perishable Foods Markets","i3","Waste","ü",null,null,"ü"]
[null,null,"t117i4","t117","Livestock and Perishable Foods Markets","i4","Product Hygiene","ü",null,"ü"]
[null,null,"t117i5","t117","Livestock and Perishable Foods Markets","i5","Odour","ü",null,"ü","ü"]
[null,null,"t117i6","t117","Livestock and Perishable Foods Markets","i6","Packaging","ü"]
[null,null,"t117i7","t117","Livestock and Perishable Foods Markets","i7","Refrigerants","ü",null,"ü"]
[null,null,"t117i8","t117","Livestock and Perishable Foods Markets","i8","Polychlorinated Biphenyls (PCBs)","ü",null,"ü"]
[null,null,"t117i9","t117","Livestock and Perishable Foods Markets","i9","Asbestos","ü",null,"ü"]
[null,null,"t117i10","t117","Livestock and Perishable Foods Markets","i10","Slips, Trips and Falls",null,"ü","ü"]
[null,null,"t117i11","t117","Livestock and Perishable Foods Markets","i11","Collision Risk",null,"ü","ü"]
[null,null,"t117i12","t117","Livestock and Perishable Foods Markets","i12","Sharp Edges and Machinery",null,"ü","ü"]
[null,null,"t117i13","t117","Livestock and Perishable Foods Markets","i13","Manual Handling",null,"ü","ü"]
[null,null,"t117i14","t117","Livestock and Perishable Foods Markets","i14","Hazardous Materials",null,"ü","ü"]
[null,null,"t117i15","t117","Livestock and Perishable Foods Markets","i15","Air Emissions","ü","ü",null,"ü"]
[null,null,"t117i16","t117","Livestock and Perishable Foods Markets","i16","Fire","ü","ü",null,"ü"]
[null,null,"t117i17","t117","Livestock and Perishable Foods Markets","i17","Animal Welfare","ü","ü",null,"ü"]
[null,null,"t117i18","t117","Livestock and Perishable Foods Markets","i18","Biosecurity","ü","ü",null,"ü"]
[null,null,"t117i19","t117","Livestock and Perishable Foods Markets","i19","Traffic Management",null,"ü","ü","ü"]
[null,null,"t117i20","t117","Livestock and Perishable Foods Markets","i20","Community Relations",null,null,null,"ü"]
[null,null,"t118i1","t118","Commercial Fishing","i1","Overfishing","ü",null,null,"ü"]
[null,null,"t118i2","t118","Commercial Fishing","i2","Bycatch","ü",null,null,"ü"]
[null,null,"t118i3","t118","Commercial Fishing","i3","Discards","ü",null,null,"ü"]
[null,null,"t118i4","t118","Commercial Fishing","i4","Damage to Marine Habitats","ü",null,null,"ü"]
[null,null,"t118i5","t118","Commercial Fishing","i5","Ghost Fishing","ü"]
[null,null,"t118i6","t118","Commercial Fishing","i6","Disposal of Waste","ü"]
[null,null,"t118i7","t118","Commercial Fishing","i7","Wastewater","ü"]
[null,null,"t118i8","t118","Commercial Fishing","i8","Vessel Worthiness",null,"ü"]
[null,null,"t118i9","t118","Commercial Fishing","i9","Manual Handling",null,"ü"]
[null,null,"t118i10","t118","Commercial Fishing","i10","Slips, Trips and Falls",null,"ü"]
[null,null,{"$f":"D1213&F1213","v":"t118i11"},"t118","Commercial Fishing","i11","Electrical Safety",null,"ü"]
[null,null,"t118i12","t118","Commercial Fishing","i12","Fire Risk",null,"ü"]
[null,null,"t118i13","t118","Commercial Fishing","i13","Moving Equipment and Machinery",null,"ü"]
[null,null,"t118i14","t118","Commercial Fishing","i14","Confined Space",null,"ü"]
[null,null,"t118i15","t118","Commercial Fishing","i15","Drowning Risk",null,"ü"]
[null,null,"t118i16","t118","Commercial Fishing","i16","Refrigerants","ü","ü"]
[null,null,"t118i17","t118","Commercial Fishing","i17","Energy Use","ü"]
[null,null,"t118i18","t118","Commercial Fishing","i18","Noise","ü","ü"]
[null,null,"t118i19","t118","Commercial Fishing","i19","Hazardous Materials","ü","ü"]
[null,null,"t118i20","t118","Commercial Fishing","i20","Health of Employees (Disease)",null,"ü","ü"]
[null,null,"t118i21","t118","Commercial Fishing","i21","Hygiene","ü","ü","ü"]
[null,null,"t118i22","t118","Commercial Fishing","i22","Odour ","ü","ü",null,"ü"]
[null,null,"t119i1","t119","Manufacture of Non-Alcoholic Beverages","i1","Water Use","ü","ü",null,"ü"]
[null,null,"t119i2","t119","Manufacture of Non-Alcoholic Beverages","i2","Wastewater","ü",null,null,"ü"]
[null,null,"t119i3","t119","Manufacture of Non-Alcoholic Beverages","i3","Energy Use","ü"]
[null,null,"t119i4","t119","Manufacture of Non-Alcoholic Beverages","i4","Air Emissions","ü","ü",null,"ü"]
[null,null,"t119i5","t119","Manufacture of Non-Alcoholic Beverages","i5","Refrigerants","ü","ü",null,"ü"]
[null,null,"t119i6","t119","Manufacture of Non-Alcoholic Beverages","i6","Hazardous Materials","ü","ü"]
[null,null,"t119i7","t119","Manufacture of Non-Alcoholic Beverages","i7","Solid Waste","ü","ü",null,"ü"]
[null,null,"t119i8","t119","Manufacture of Non-Alcoholic Beverages","i8","Moving Equipment",null,"ü","ü"]
[null,null,"t119i9","t119","Manufacture of Non-Alcoholic Beverages","i9","Slips, Trips & Falls",null,"ü","ü"]
[null,null,"t119i10","t119","Manufacture of Non-Alcoholic Beverages","i10","Manual Handling",null,"ü","ü"]
[null,null,"t119i11","t119","Manufacture of Non-Alcoholic Beverages","i11","Noise",null,"ü","ü","ü"]
[null,null,"t119i12","t119","Manufacture of Non-Alcoholic Beverages","i12","C02 and Asphyxiation",null,"ü","ü"]
[null,null,"t119i13","t119","Manufacture of Non-Alcoholic Beverages","i13","Temperature Exposure",null,"ü","ü"]
[null,null,"t119i14","t119","Manufacture of Non-Alcoholic Beverages","i14","Odour",null,"ü","ü"]
[null,null,"t119i15","t119","Manufacture of Non-Alcoholic Beverages","i15","Hygiene","ü","ü","ü"]
[null,null,"t119i16","t119","Manufacture of Non-Alcoholic Beverages","i16","Fires & Explosions",null,"ü","ü","ü"]
[null,null,"t119i17","t119","Manufacture of Non-Alcoholic Beverages","i17","Transport Risk",null,"ü",null,"ü"]
[null,null,"t120i1","t120","Open Pit Mining","i1","Water Use","ü",null,null,"ü"]
[null,null,"t120i2","t120","Open Pit Mining","i2","Pit Water ","ü",null,null,"ü"]
[null,null,"t120i3","t120","Open Pit Mining","i3","Stormwater","ü",null,null,"ü"]
[null,null,"t120i4","t120","Open Pit Mining","i4","Acid Mine Drainage (AMD) and Leachate","ü",null,null,"ü"]
[null,null,"t120i5","t120","Open Pit Mining","i5","Waste","ü"]
[null,null,"t120i6","t120","Open Pit Mining","i6","Hazardous Materials","ü","ü",null,"ü"]
[null,null,"t120i7","t120","Open Pit Mining","i7","Ionising Radiation",null,"ü"]
[null,null,"t120i8","t120","Open Pit Mining","i8","Habitat Loss and Biodiversity","ü",null,null,"ü"]
[null,null,"t120i9","t120","Open Pit Mining","i9","Air Emissions","ü","ü","ü","ü"]
[null,null,"t120i10","t120","Open Pit Mining","i10","Geotechnical Stability","ü","ü",null,"ü"]
[null,null,"t120i11","t120","Open Pit Mining","i11","Noise and Vibration ","ü","ü","ü","ü"]
[null,null,"t120i12","t120","Open Pit Mining","i12","Moving Equipment & Machinery",null,"ü"]
[null,null,"t120i13","t120","Open Pit Mining","i13","Manual Handling",null,"ü"]
[null,null,"t120i14","t120","Open Pit Mining","i14","Slips, Trips and Falls",null,"ü"]
[null,null,"t120i15","t120","Open Pit Mining","i15","Fire and Explosion",null,"ü",null,"ü"]
[null,null,"t120i16","t120","Open Pit Mining","i16","Community Displacement and Resettlement",null,null,null,"ü"]
[null,null,"t120i17","t120","Open Pit Mining","i17","Indigenous People",null,null,null,"ü"]
[null,null,"t120i18","t120","Open Pit Mining","i18","Migrant Workers and Contractors",null,"ü","ü","ü"]
[null,null,"t120i19","t120","Open Pit Mining","i19","Community Health and Safety",null,null,null,"ü"]
[null,null,"t120i20","t120","Open Pit Mining","i20","Worker Accommodation",null,null,"ü"]
[null,null,"t120i21","t120","Open Pit Mining","i21","Visual Impact","ü",null,null,"ü"]
[null,null,"t120i22","t120","Open Pit Mining","i22","Financial Dependency",null,null,"ü","ü"]
[null,null,"t120i23","t120","Open Pit Mining","i23","Traffic Management",null,"ü",null,"ü"]
[null,null,"t120i24","t120","Open Pit Mining","i24","Temperature Exposure",null,"ü","ü"]
[null,null,"t120i25","t120","Open Pit Mining","i25","Remote Site Health",null,"ü","ü"]
[null,null,"t120i26","t120","Open Pit Mining","i26","Mine Closure and Rehabilitation","ü",null,null,"ü"]
[null,null,"t121i1","t121","Salt Extraction","i1","Water Use","ü",null,null,"ü"]
[null,null,"t121i2","t121","Salt Extraction","i2","Runoff & Leachate","ü",null,null,"ü"]
[null,null,"t121i3","t121","Salt Extraction","i3","Groundwater","ü",null,null,"ü"]
[null,null,"t121i4","t121","Salt Extraction","i4","Biodiversity","ü",null,null,"ü"]
[null,null,"t121i5","t121","Salt Extraction","i5","Solid Waste","ü",null,null,"ü"]
[null,null,"t121i6","t121","Salt Extraction","i6","Hazardous Materials","ü","ü",null,"ü"]
[null,null,"t121i7","t121","Salt Extraction","i7","Visual Impact",null,null,null,"ü"]
[null,null,"t121i8","t121","Salt Extraction","i8","Land Stability","ü","ü",null,"ü"]
[null,null,"t121i9","t121","Salt Extraction","i9","Working Conditions",null,"ü"]
[null,null,{"$f":"D1277&F1277","v":"t121i10"},"t121","Salt Extraction","i10","Dust","ü","ü",null,"ü"]
[null,null,"t121i11","t121","Salt Extraction","i11","Noise & Vibration","ü",null,null,"ü"]
[null,null,"t121i12","t121","Salt Extraction","i12","Traffic Management",null,"ü",null,"ü"]
[null,null,"t121i13","t121","Salt Extraction","i13","Manual Handling",null,"ü"]
[null,null,"t121i14","t121","Salt Extraction","i14","Slips, Trips & Falls",null,"ü"]
[null,null,"t121i15","t121","Salt Extraction","i15","Relations with Local Communities",null,null,null,"ü"]
[null,null,"t122i1","t122","Manufacture of Rolling Stock and Railway Locomotives ","i1","Air Emissions ","ü","ü",null,"ü"]
[null,null,"t122i2","t122","Manufacture of Rolling Stock and Railway Locomotives ","i2","Wastewater ","ü",null,null,"ü"]
[null,null,"t122i3","t122","Manufacture of Rolling Stock and Railway Locomotives ","i3","Waste","ü",null,null,"ü"]
[null,null,"t122i4","t122","Manufacture of Rolling Stock and Railway Locomotives ","i4","Soil and Groundwater Contamination","ü",null,null,"ü"]
[null,null,"t122i5","t122","Manufacture of Rolling Stock and Railway Locomotives ","i5","Hazardous Materials","ü","ü",null,"ü"]
[null,null,"t122i6","t122","Manufacture of Rolling Stock and Railway Locomotives ","i6","Noise","ü","ü",null,"ü"]
[null,null,"t122i7","t122","Manufacture of Rolling Stock and Railway Locomotives ","i7","Moving Equipment and Machinery",null,"ü"]
[null,null,"t122i8","t122","Manufacture of Rolling Stock and Railway Locomotives ","i8","Slips, Trips and Falls",null,"ü"]
[null,null,"t122i9","t122","Manufacture of Rolling Stock and Railway Locomotives ","i9","Manual Handling",null,"ü"]
[null,null,"t123i1","t123","Brick Manufacturing","i1","Air Emissions","ü","ü",null,"ü"]
[null,null,"t123i2","t123","Brick Manufacturing","i2","Noise","ü","ü","ü","ü"]
[null,null,"t123i3","t123","Brick Manufacturing","i3","Water Use","ü",null,null,"ü"]
[null,null,"t123i4","t123","Brick Manufacturing","i4","Wastewater","ü"]
[null,null,"t123i5","t123","Brick Manufacturing","i5","Biodiversity","ü"]
[null,null,"t123i6","t123","Brick Manufacturing","i6","Solid Waste","ü",null,null,"ü"]
[null,null,"t123i7","t123","Brick Manufacturing","i7","Energy Use","ü"]
[null,null,"t123i8","t123","Brick Manufacturing","i8","PCBs/Asbestos",null,"ü"]
[null,null,"t123i9","t123","Brick Manufacturing","i9","Hazardous Materials","ü","ü","ü"]
[null,null,"t123i10","t123","Brick Manufacturing","i10","Machine & Electrical Safety",null,"ü"]
[null,null,"t123i11","t123","Brick Manufacturing","i11","Manual Handling",null,"ü","ü"]
[null,null,"t123i12","t123","Brick Manufacturing","i12","Slips, Trips & Falls",null,"ü"]
[null,null,"t123i13","t123","Brick Manufacturing","i13","Temperature Exposure",null,"ü"]
[null,null,"t123i14","t123","Brick Manufacturing","i14","Confined Space",null,"ü"]
[null,null,"t123i15","t123","Brick Manufacturing","i15","Labour & Working Conditions",null,null,"ü"]
[null,null,"t123i16","t123","Brick Manufacturing","i16","Community Relations",null,null,null,"ü"]
[null,null,"t124i1","t124","Eating and Drinking Places","i1","Product Contamination & Food Hygiene",null,"ü",null,"ü"]
[null,null,"t124i2","t124","Eating and Drinking Places","i2","Water Use","ü",null,null,"ü"]
[null,null,"t124i3","t124","Eating and Drinking Places","i3","Wastewater","ü",null,null,"ü"]
[null,null,"t124i4","t124","Eating and Drinking Places","i4","Fats, Oils & Greases","ü"]
[null,null,"t124i5","t124","Eating and Drinking Places","i5","Food Waste","ü",null,null,"ü"]
[null,null,"t124i6","t124","Eating and Drinking Places","i6","Solid Waste","ü",null,null,"ü"]
[null,null,"t124i7","t124","Eating and Drinking Places","i7","Energy Use","ü",null,null,"ü"]
[null,null,"t124i8","t124","Eating and Drinking Places","i8","Refrigerants","ü"]
[null,null,"t124i9","t124","Eating and Drinking Places","i9","Manual Handling",null,"ü"]
[null,null,"t124i10","t124","Eating and Drinking Places","i10","Slips, Trips & Falls",null,"ü"]
[null,null,"t124i11","t124","Eating and Drinking Places","i11","Machine & Electrical Safety",null,"ü","ü"]
[null,null,"t124i12","t124","Eating and Drinking Places","i12","Asbestos","ü","ü","ü"]
[null,null,"t124i13","t124","Eating and Drinking Places","i13","Temperature Exposure",null,"ü","ü"]
[null,null,"t124i14","t124","Eating and Drinking Places","i14","Dermatitis",null,"ü"]
[null,null,"t124i15","t124","Eating and Drinking Places","i15","Hazardous Materials","ü","ü"]
[null,null,"t124i16","t124","Eating and Drinking Places","i16","Work Related Violence",null,"ü","ü"]
[null,null,"t124i17","t124","Eating and Drinking Places","i17","Labour and Working Conditions",null,null,"ü","ü"]
[null,null,"t125i1","t125","Shipping","i1","Air Emissions","ü","ü",null,"ü"]
[null,null,"t125i2","t125","Shipping","i2","Water Pollution","ü",null,null,"ü"]
[null,null,"t125i3","t125","Shipping","i3","Biodiversity","ü"]
[null,null,"t125i4","t125","Shipping","i4","Solid Waste","ü",null,null,"ü"]
[null,null,"t125i5","t125","Shipping","i5","Hazardous Materials","ü",null,"ü","ü"]
[null,null,"t125i6","t125","Shipping","i6","Collision Risk","ü","ü",null,"ü"]
[null,null,"t125i7","t125","Shipping","i7","Moving Equipment and Machinery",null,"ü"]
[null,null,"t125i8","t125","Shipping","i8","Slips, Trips and Falls",null,"ü"]
[null,null,"t125i9","t125","Shipping","i9","Fire Risk",null,"ü"]
[null,null,"t125i10","t125","Shipping","i10","Confined Spaces",null,"ü"]
[null,null,"t125i11","t125","Shipping","i11","Noise and Vibration",null,"ü",null,"ü"]
[null,null,"t125i12","t125","Shipping","i12","Working near Water/Drowning",null,"ü"]
[null,null,"t125i13","t125","Shipping","i13","Health of Employees",null,"ü"]
[null,null,"t125i14","t125","Shipping","i14","Capsize Risk",null,"ü",null,"ü"]
[null,null,"t125i15","t125","Shipping","i15","Illegal Immigrants",null,null,null,"ü"]
[null,null,"t126i1","t126","Hotels","i1","Biodiversity","ü",null,null,"ü"]
[null,null,{"$f":"D1341&F1341","v":"t126i2"},"t126","Hotels","i2","Water Use","ü","ü",null,"ü"]
[null,null,"t126i3","t126","Hotels","i3","Wastewater","ü",null,null,"ü"]
[null,null,"t126i4","t126","Hotels","i4","Waste","ü","ü",null,"ü"]
[null,null,"t126i5","t126","Hotels","i5","Energy Use","ü",null,null,"ü"]
[null,null,"t126i6","t126","Hotels","i6","Air Emissions","ü"]
[null,null,"t126i7","t126","Hotels","i7","Noise","ü","ü","ü","ü"]
[null,null,"t126i8","t126","Hotels","i8","PCBs & Asbestos","ü","ü"]
[null,null,"t126i9","t126","Hotels","i9","Hazardous Materials","ü","ü"]
[null,null,"t126i10","t126","Hotels","i10","Machine & Electrical Safety",null,"ü"]
[null,null,"t126i11","t126","Hotels","i11","Manual Handling",null,"ü"]
[null,null,"t126i12","t126","Hotels","i12","Labour & Working Conditions",null,null,"ü"]
[null,null,"t126i13","t126","Hotels","i13","Fire Safety",null,"ü"]
[null,null,"t126i14","t126","Hotels","i14","Corruption & Bribery",null,"ü","ü","ü"]
[null,null,"t126i15","t126","Hotels","i15","Community Relations",null,null,null,"ü"]
[null,null,"t126i16","t126","Hotels","i16","Sexual Exploitation",null,"ü","ü"]
[null,null,"t127i1","t127","Glass Manufacturing","i1","Air Emissions","ü","ü",null,"ü"]
[null,null,"t127i2","t127","Glass Manufacturing","i2","Noise Emissions","ü","ü",null,"ü"]
[null,null,"t127i3","t127","Glass Manufacturing","i3","Water Use","ü",null,null,"ü"]
[null,null,"t127i4","t127","Glass Manufacturing","i4","Wastewater","ü"]
[null,null,"t127i5","t127","Glass Manufacturing","i5","Solid Waste","ü",null,null,"ü"]
[null,null,"t127i6","t127","Glass Manufacturing","i6","Energy Use","ü"]
[null,null,"t127i7","t127","Glass Manufacturing","i7","PCBs/Asbestos",null,"ü"]
[null,null,"t127i8","t127","Glass Manufacturing","i8","Hazardous Materials","ü","ü"]
[null,null,"t127i9","t127","Glass Manufacturing","i9","Machine and Electrical Safety",null,"ü"]
[null,null,"t127i10","t127","Glass Manufacturing","i10","Traffic Management",null,"ü",null,"ü"]
[null,null,"t127i11","t127","Glass Manufacturing","i11","Manual Handling",null,"ü"]
[null,null,"t127i12","t127","Glass Manufacturing","i12","Slips, Trips and Falls",null,"ü"]
[null,null,"t127i13","t127","Glass Manufacturing","i13","Temperature Exposure",null,"ü"]
[null,null,"t127i14","t127","Glass Manufacturing","i14","Confined Spaces",null,"ü"]
[null,null,"t127i15","t127","Glass Manufacturing","i15","Labour and Working Conditions",null,"ü","ü"]
[null,null,"t127i16","t127","Glass Manufacturing","i16","Relations with Local Communities",null,null,null,"ü"]
[null,null,"t128i1","t128","Breweries","i1","Water Use","ü"]
[null,null,"t128i2","t128","Breweries","i2","Wastewater ","ü"]
[null,null,"t128i3","t128","Breweries","i3","Waste","ü"]
[null,null,"t128i4","t128","Breweries","i4","Contamination of Soil and Water","ü",null,null,"ü"]
[null,null,"t128i5","t128","Breweries","i5","Energy Use","ü"]
[null,null,"t128i6","t128","Breweries","i6","Air Emissions ","ü","ü","ü","ü"]
[null,null,"t128i7","t128","Breweries","i7","Odour","ü","ü","ü","ü"]
[null,null,"t128i8","t128","Breweries","i8","Refrigerants","ü"]
[null,null,"t128i9","t128","Breweries","i9","Hazardous Materials",null,"ü","ü"]
[null,null,"t128i10","t128","Breweries","i10","Polychlorinated Biphenyls (PCBs)",null,"ü","ü"]
[null,null,"t128i11","t128","Breweries","i11","Temperature Exposure",null,"ü","ü"]
[null,null,"t128i12","t128","Breweries","i12","Confined Spaces",null,"ü","ü"]
[null,null,"t128i13","t128","Breweries","i13","Moving Equipment and Machinery",null,"ü"]
[null,null,"t128i14","t128","Breweries","i14","Explosion Risk",null,"ü"]
[null,null,"t128i15","t128","Breweries","i15","Slips, Trips and Falls",null,"ü"]
[null,null,"t128i16","t128","Breweries","i16","Manual Handling",null,"ü"]
[null,null,"t128i17","t128","Breweries","i17","Occupational Dermatitis",null,"ü"]
[null,null,"t128i18","t128","Breweries","i18","Working at Height",null,"ü"]
[null,null,"t128i19","t128","Breweries","i19","Noise",null,"ü","ü","ü"]
[null,null,"t128i20","t128","Breweries","i20","Asbestos",null,"ü","ü"]
[null,null,"t128i21","t128","Breweries","i21","Radiation Sources",null,"ü","ü"]
[null,null,"t128i22","t128","Breweries","i22","Product Hygiene",null,"ü","ü"]
[null,null,"t128i23","t128","Breweries","i23","Transportation Risks",null,"ü",null,"ü"]
[null,null,"t129i1","t129","Commercial Forestry","i1","Illegal Logging","ü"]
[null,null,"t129i2","t129","Commercial Forestry","i2","Sustainable Harvesting","ü"]
[null,null,"t129i3","t129","Commercial Forestry","i3","Biodiversity Impacts","ü"]
[null,null,"t129i4","t129","Commercial Forestry","i4","Exotic Species","ü"]
[null,null,"t129i5","t129","Commercial Forestry","i5","Use of Water Resources/Hydrological Regime","ü",null,null,"ü"]
[null,null,"t129i6","t129","Commercial Forestry","i6","Storage of Chemicals, Fuels and Oils","ü","ü","ü"]
[null,null,"t129i7","t129","Commercial Forestry","i7","Soil Erosion and Degradation","ü",null,null,"ü"]
[null,null,"t129i8","t129","Commercial Forestry","i8","Disposal of Waste","ü",null,null,"ü"]
[null,null,"t129i9","t129","Commercial Forestry","i9","Strike Injuries from Moving Objects",null,"ü","ü"]
[null,null,"t129i10","t129","Commercial Forestry","i10","Handling, Lifting or Carrying",null,"ü","ü"]
[null,null,{"$f":"D1405&F1405","v":"t129i11"},"t129","Commercial Forestry","i11","Noise","ü","ü","ü","ü"]
[null,null,"t129i12","t129","Commercial Forestry","i12","Fires and Explosions",null,"ü","ü","ü"]
[null,null,"t129i13","t129","Commercial Forestry","i13","Risk of Accidents",null,"ü","ü","ü"]
[null,null,"t129i14","t129","Commercial Forestry","i14","Cultural Heritage",null,null,null,"ü"]
[null,null,"t129i15","t129","Commercial Forestry","i15","Relations with Local Communities",null,null,null,"ü"]
[null,null,"t129i16","t129","Commercial Forestry","i16","Climate Change","ü"]
[null,null,"t129i17","t129","Commercial Forestry","i17","Ethics and Bribery",null,null,"ü","ü"]
[null,null,"t129i18","t129","Commercial Forestry","i18","Property and Land Use",null,null,"ü","ü"]
[null,null,"t130i1","t130","Industrial Equipment and machines","i1","Hazardous Materials","ü","ü",null,"ü"]
[null,null,"t130i2","t130","Industrial Equipment and machines","i2","Occupational Health and Safety ",null,"ü","ü"]
[null,null,"t130i3","t130","Industrial Equipment and machines","i3","Air Emissions","ü","ü",null,"ü"]
[null,null,"t130i4","t130","Industrial Equipment and machines","i4","Energy Consumption","ü"]
[null,null,"t130i5","t130","Industrial Equipment and machines","i5","Water management and wastewater","ü","ü",null,"ü"]
[null,null,"t130i6","t130","Industrial Equipment and machines","i6","Solid Waste","ü","ü",null,"ü"]
[null,null,"t130i7","t130","Industrial Equipment and machines","i7","Labour Rights",null,null,"ü","ü"]
[null,null,"t130i8","t130","Industrial Equipment and machines","i8","Community and Social Risks  ",null,null,null,"ü"]

{"sheet":"3","index":12,"n_rows":14,"n_cols":3,"rows_kept":14,"cut":false,"hidden":true,"merged":[]}
[null,"3. Compliance Check - Dropdown Options"]
[]
[]
[null,null,"DD_ComplianceCheck_1"]
[null,null,"Yes"]
[null,null,"No"]
[null,null,"tbc"]
[]
[]
[null,null,"DD_ComplianceCheck_2"]
[null,null,"Yes"]
[null,null,"No"]
[null,null,"tbc"]
[null,null,"n/a"]

{"sheet":"4","index":13,"n_rows":35,"n_cols":18,"rows_kept":35,"cut":false,"hidden":true,"merged":[]}
[null,"4. CC&TR Scoring"]
[]
[null,null,null,null,null,"Score Matrix"]
[null,null,null,null,3,2,1,0,null,{"$f":"AND(   1=(J7+J12+J17),   1=SUM(J8:J11),   1=SUM(J13:J16),   1=SUM(J18:J23)   )","v":true},null,"Benchmark Score Model Answers"]
[]
[null,null,"Q #","A #","Leadership","Good Practice","Satisfactory","Deficient",null,"Question weightings",null,"Corporate loan","SME loan","Equity_active","Equity_passive"]
[null,null,"Commitment",null,1,2,3,4,null,0.25,null,"-","-","-","-"]
[null,null,1,0,{"$f":"$J8*$J$7*IF($D8=E$7,E$4,0)","v":0},0,0,0,null,0.35,null,2,1,2,1]
[null,null,2,0,0,0,0,0,null,0.35,null,2,2,2,2]
[null,null,3,0,0,0,0,0,null,0.2,null,2,1,2,1]
[null,null,4,0,0,0,0,0,null,0.1,null,2,1,2,1]
[null,null,"Capacity",null,1,2,3,4,null,0.4,null,"-","-","-","-"]
[null,null,5,0,{"$f":"$J13*$J$12*IF($D13=E$12,E$4,0)","v":0},0,0,0,null,0.3,null,2,1,2,1]
[null,null,6,0,0,0,0,0,null,0.3,null,2,2,2,2]
[null,null,7,0,0,0,0,0,null,0.3,null,2,2,2,2]
[null,null,8,0,0,0,0,0,null,0.1,null,2,1,2,1]
[null,null,"Track Record",null,1,2,3,4,null,0.35,null,"-","-","-","-"]
[null,null,9,0,{"$f":"$J18*$J$17*IF($D18=E$17,E$4,0)","v":0},0,0,0,null,0.15,null,2,1,2,1]
[null,null,10,0,0,0,0,0,null,0.25,null,2,2,2,2]
[null,null,11,0,0,0,0,0,null,0.25,null,2,2,2,2]
[null,null,12,0,0,0,0,0,null,0.15,null,2,1,2,1]
[null,null,13,0,0,0,0,0,null,0.15,null,2,1,2,1]
[null,null,14,0,0,0,0,0,null,0.05,null,2,1,2,1]
[]
[null,null,null,null,"Best Practice \nScore",{"$f":"\"Benchmark Score\"&IF(LendingType=\"{Please select}\",\"\",\" \n(\"&LendingType&\")\")","v":"Benchmark Score"},"Customer \nScore",null,null,null,null,"Corporate loan","SME loan","Equity_active","Equity_passive"]
[null,null,"Commitment",null,{"$f":"(E4*J7)*(100/E30)","v":25},{"$f":"IFERROR(     INDEX($L26:$O26,0,MATCH(LendingType,$L$25:$O$25,0)),     0)","v":0},{"$f":"SUM(E8:H11)*(100/$E$30)","v":0},null,null,null,null,{"$f":"$J$7*SUMPRODUCT($J8:$J11,L8:L11)*(100/$E$30)","v":16.666666666666664},{"$f":"$J$7*SUMPRODUCT($J8:$J11,M8:M11)*(100/$E$30)","v":11.25},{"$f":"$J$7*SUMPRODUCT($J8:$J11,N8:N11)*(100/$E$30)","v":16.666666666666664},{"$f":"$J$7*SUMPRODUCT($J8:$J11,O8:O11)*(100/$E$30)","v":11.25}]
[null,null,"Capacity",null,{"$f":"(E4*J12)*(100/E30)","v":40.000000000000007},{"$f":"IFERROR(     INDEX($L27:$O27,0,MATCH(LendingType,$L$25:$O$25,0)),     0)","v":0},{"$f":"SUM(E13:H16)*(100/$E$30)","v":0},null,null,null,null,{"$f":"$J$12*SUMPRODUCT($J13:$J16,L13:L16)*(100/$E$30)","v":26.666666666666668},{"$f":"$J$12*SUMPRODUCT($J13:$J16,M13:M16)*(100/$E$30)","v":21.333333333333339},{"$f":"$J$12*SUMPRODUCT($J13:$J16,N13:N16)*(100/$E$30)","v":26.666666666666668},{"$f":"$J$12*SUMPRODUCT($J13:$J16,O13:O16)*(100/$E$30)","v":21.333333333333339}]
[null,null,"Track Record",null,{"$f":"(E4*J17)*(100/E30)","v":35},{"$f":"IFERROR(     INDEX($L28:$O28,0,MATCH(LendingType,$L$25:$O$25,0)),     0)","v":0},{"$f":"SUM(E18:H23)*(100/$E$30)","v":0},null,null,null,null,{"$f":"$J$17*SUMPRODUCT($J18:$J23,L18:L23)*(100/$E$30)","v":23.333333333333332},{"$f":"$J$17*SUMPRODUCT($J18:$J23,M18:M23)*(100/$E$30)","v":17.5},{"$f":"$J$17*SUMPRODUCT($J18:$J23,N18:N23)*(100/$E$30)","v":23.333333333333332},{"$f":"$J$17*SUMPRODUCT($J18:$J23,O18:O23)*(100/$E$30)","v":17.5}]
[null,null,"Total",null,{"$f":"SUM(E26:E28)","v":100},{"$f":"IFERROR(     INDEX($L29:$O29,0,MATCH(LendingType,$L$25:$O$25,0)),     0)","v":0},{"$f":"SUM(G26:G28)","v":0},null,null,null,null,{"$f":"SUM(L26:L28)","v":66.666666666666657},{"$f":"SUM(M26:M28)","v":50.083333333333343},{"$f":"SUM(N26:N28)","v":66.666666666666657},50.083333333333343]
[null,null,null,null,{"$f":"E4*(J7+J12+J17)","v":3}]
[]
[null,null,"Track Record (only)",null,{"$f":"100*E28/$E$28","v":100},{"$f":"100*F28/$E$28","v":0},0,null,null,null,null,100,100,100,100,null,{"$f":"IFERROR(     INDEX($L32:$O32,0,MATCH(LendingType,$L$25:$O$25,0)),     $L32)","v":100},"Best Practice"]
[null,null,null,null,null,null,null,null,null,null,null,67,67,67,67,null,{"$f":"IFERROR(     INDEX($L33:$O33,0,MATCH(LendingType,$L$25:$O$25,0)),     $L33)","v":67},"Good Practice"]
[null,null,null,null,null,null,null,null,null,null,null,33,33,33,33,null,{"$f":"IFERROR(     INDEX($L34:$O34,0,MATCH(LendingType,$L$25:$O$25,0)),     $L34)","v":33},"Satisfactory"]
[null,null,null,null,null,null,null,null,null,null,null,0,0,0,0,null,{"$f":"IFERROR(     INDEX($L35:$O35,0,MATCH(LendingType,$L$25:$O$25,0)),     $L35)","v":0},"Deficient"]

{"sheet":"5","index":14,"n_rows":13,"n_cols":3,"rows_kept":13,"cut":false,"hidden":true,"merged":[]}
[null,"5. Site Visit Checklist - Dropdown Options"]
[]
[]
[null,null,"DD_SiteVisitChecklist_1"]
[null,null,"Yes"]
[null,null,"No"]
[]
[]
[]
[null,null,"DD_SiteVisitChecklist_2"]
[null,null,"Yes"]
[null,null,"No"]
[null,null,"n/a"]